program: Orca
programVersion: 5.0.2
elementType: F F O O O O N C C C C C C C C C C C C C C C C C C C C C C C C C C H H H H H H H H H H H H H H H H H H H H H H H
charge: 0
multiplicity: 1
keywords: wb97x-d3
keywords: def2-TZVPP
keywords: def2/J RIJCOSX
keywords: DEFGRID2
keywords: scfconv7
keywords: smallprint printgap noloewdin
keywords: NOSOSCF
formula: C26H23F2NO4
InChI: InChI=1/C26H23F2NO4/c1-17(2)24(18-11-13-21(14-12-18)32-26(27)28)25(30)33-23(16-29)19-7-6-10-22(15-19)31-20-8-4-3-5-9-20/h3-15,17,23-24,26H,1-2H3
56 atoms
F  -4.229079 -2.914261 -0.936842
F  -3.63577 -2.62268 1.118904
O  3.287476 0.427947 0.85057
O  4.022042 -0.030697 -1.210762
O  -2.401031 -1.819028 -0.556636
O  -1.73882 1.304406 0.604452
N  3.180838 3.148555 2.728292
C  3.222432 -1.827646 0.200482
C  3.993362 -2.877555 -0.610435
C  1.718079 -1.865354 0.003127
C  5.478869 -2.834958 -0.267389
C  3.434283 -4.270438 -0.344233
C  3.597425 -0.409018 -0.153044
C  1.155935 -1.645163 -1.253048
C  0.870671 -2.068821 1.084118
C  3.080953 1.795108 0.497447
C  -0.217454 -1.646529 -1.426063
C  -0.508717 -2.066976 0.928364
C  -1.042767 -1.861747 -0.333416
C  1.739665 1.941342 -0.179872
C  0.581148 1.6276 0.524423
C  1.672985 2.29997 -1.517755
C  -0.643522 1.671353 -0.12052
C  3.14128 2.538845 1.756071
C  0.438189 2.33455 -2.152516
C  -0.721183 2.014136 -1.467291
C  -3.156958 -2.861776 -0.12908
C  -2.924509 1.973048 0.461006
C  -2.987261 3.346587 0.257361
C  -4.085973 1.224404 0.592041
C  -4.227989 3.961445 0.165932
C  -5.318282 1.855757 0.511014
C  -5.397161 3.223388 0.288137
H  3.427277 -1.987592 1.263881
H  3.872297 -2.657768 -1.67556
H  6.030305 -3.569021 -0.856895
H  5.642135 -3.071314 0.786833
H  5.930292 -1.861459 -0.462993
H  2.395669 -4.368925 -0.661364
H  4.010954 -5.021548 -0.886165
H  3.483116 -4.522563 0.718051
H  1.787443 -1.473061 -2.115853
H  1.286635 -2.225899 2.0716
H  3.882881 2.171828 -0.144545
H  -0.647368 -1.476271 -2.404875
H  -1.142975 -2.208947 1.793328
H  0.620756 1.347699 1.571128
H  2.574367 2.54478 -2.064511
H  0.378985 2.602105 -3.199112
H  -1.673976 2.029102 -1.981105
H  -2.636621 -3.822789 -0.12652
H  -2.085486 3.940027 0.174401
H  -4.026336 0.158322 0.765891
H  -4.275358 5.030658 0.00428
H  -6.221359 1.268191 0.61412
H  -6.360286 3.711084 0.216067
elementType: F O N C H
totalener: -1560.11868031 hartree
nucrepener: 3450.45232148 hartree
electener: -5010.57100179 hartree
oneelecener: -8992.67561542 hartree
twoeener: 3982.10461363 hartree
cpcmener: -0.03633018 hartree
kineticenergy: 1553.65155968 hartree
xcener: -146.818248945978 hartree
chargesum: -0.0000000
charge: -0.204516 -0.217333 -0.279093 -0.413242 -0.311267 -0.325047 -0.085415 0.122587 0.065667 -0.012187 -0.292510 -0.310559 0.318225 -0.195885 -0.177080 0.418935 -0.210851 -0.120209 0.217946 0.059971 -0.299103 -0.177879 0.277378 -0.241603 -0.109001 -0.199318 0.406357 0.290898 -0.194904 -0.236933 -0.153693 -0.142542 -0.176575 0.098335 0.044117 0.093333 0.087834 0.095141 0.097239 0.098269 0.089692 0.140377 0.138720 0.138911 0.148009 0.148139 0.131528 0.144336 0.160315 0.156018 0.138910 0.153560 0.135411 0.158185 0.155333 0.157071
qa: -0.2045 -0.2173 -0.2791 -0.4132 -0.3113 -0.3250 -0.0854 0.1226 0.0657 -0.0122 -0.2925 -0.3106 0.3182 -0.1959 -0.1771 0.4189 -0.2109 -0.1202 0.2179 0.0600 -0.2991 -0.1779 0.2774 -0.2416 -0.1090 -0.1993 0.4064 0.2909 -0.1949 -0.2369 -0.1537 -0.1425 -0.1766 0.0983 0.0441 0.0933 0.0878 0.0951 0.0972 0.0983 0.0897 0.1404 0.1387 0.1389 0.1480 0.1481 0.1315 0.1443 0.1603 0.1560 0.1389 0.1536 0.1354 0.1582 0.1553 0.1571
va: 1.0745 1.0501 2.1494 2.0837 2.0050 2.0289 3.1119 3.6756 3.8081 3.4798 3.9280 3.9507 4.2873 3.9241 3.9643 3.7337 4.0061 3.9238 3.6874 3.5526 4.0784 3.9478 3.6546 4.0860 3.8896 3.9332 4.2246 3.6990 3.9101 3.9680 3.8969 3.9275 3.9011 1.0367 1.0274 1.0046 1.0022 1.0126 1.0003 1.0047 1.0020 1.0172 1.0052 1.0148 1.0046 1.0148 1.0287 1.0082 0.9893 0.9986 0.9776 0.9992 1.0341 0.9907 0.9917 0.9903
dispcorr: -0.035702208 hartree
energy: -1560.154382517622
dipole: 22.73205 -22.41838 0.31367 -7.06365 5.74051 -1.32314 -6.25253 4.86463 -1.38789
magnitude: 1.94302 au
magnitude: 4.93877 debye
