program: Orca
programVersion: 5.0.2
elementType: F F O O O O N C C C C C C C C C C C C C C C C C C C C C C C C C C H H H H H H H H H H H H H H H H H H H H H H H
charge: 0
multiplicity: 1
keywords: wb97x-d3
keywords: def2-TZVPP
keywords: def2/J RIJCOSX
keywords: DEFGRID2
keywords: scfconv7
keywords: smallprint printgap noloewdin
keywords: NOSOSCF
formula: C26H23F2NO4
InChI: InChI=1/C26H23F2NO4/c1-17(2)24(18-11-13-21(14-12-18)32-26(27)28)25(30)33-23(16-29)19-7-6-10-22(15-19)31-20-8-4-3-5-9-20/h3-15,17,23-24,26H,1-2H3
56 atoms
F  -4.121327 -2.834862 -1.471887
F  -3.637133 -1.160537 -0.19451
O  3.204676 0.434169 0.758927
O  4.171624 -0.339675 -1.10831
O  -2.080146 -2.125186 -1.458039
O  -1.757382 1.634071 1.224104
N  3.499652 3.48013 2.031342
C  3.241552 -1.89953 0.489733
C  4.196321 -3.022752 0.068864
C  1.809885 -2.046776 0.005329
C  5.581239 -2.795932 0.665888
C  3.651331 -4.376343 0.508977
C  3.637138 -0.545432 -0.052646
C  1.525318 -2.320764 -1.3319
C  0.748991 -1.801366 0.865627
C  2.963077 1.718972 0.179898
C  0.220968 -2.365003 -1.787132
C  -0.566981 -1.821231 0.422012
C  -0.82438 -2.108233 -0.909294
C  1.52767 1.759012 -0.278743
C  0.502128 1.801242 0.658641
C  1.237766 1.609856 -1.627847
C  -0.813235 1.673792 0.242677
C  3.259199 2.697076 1.22666
C  -0.085352 1.485651 -2.029959
C  -1.11578 1.503393 -1.104485
C  -3.164413 -2.339248 -0.670017
C  -3.001235 2.171628 1.036483
C  -3.207226 3.357646 0.342414
C  -4.062749 1.50913 1.637108
C  -4.49491 3.864543 0.237441
C  -5.341864 2.035338 1.535258
C  -5.566409 3.208347 0.827722
H  3.225624 -1.847053 1.582482
H  4.287638 -3.025278 -1.021186
H  6.264006 -3.591859 0.364824
H  5.540987 -2.793771 1.757782
H  6.027714 -1.852774 0.347811
H  2.693541 -4.610592 0.043328
H  4.346357 -5.172836 0.238875
H  3.513004 -4.414015 1.592269
H  2.32563 -2.503309 -2.038081
H  0.941936 -1.566692 1.905086
H  3.643457 1.918123 -0.652974
H  0.011356 -2.583674 -2.82666
H  -1.35536 -1.581476 1.123085
H  0.713392 1.909647 1.716717
H  2.035425 1.576359 -2.358876
H  -0.318457 1.353956 -3.078203
H  -2.13866 1.376607 -1.434882
H  -2.990726 -3.018583 0.16805
H  -2.379642 3.889688 -0.110019
H  -3.88539 0.594718 2.188784
H  -4.655507 4.7864 -0.306518
H  -6.167785 1.516984 2.00524
H  -6.567043 3.61099 0.741791
elementType: F O N C H
totalener: -1560.11730723 hartree
nucrepener: 3443.83310135 hartree
electener: -5003.95040859 hartree
oneelecener: -8979.04140409 hartree
twoeener: 3975.09099551 hartree
cpcmener: -0.03641668 hartree
kineticenergy: 1553.64329121 hartree
xcener: -146.818347703706 hartree
chargesum: 0.0000000
charge: -0.200565 -0.198099 -0.278284 -0.415953 -0.283998 -0.326913 -0.086174 0.132121 0.058513 0.044880 -0.295893 -0.304436 0.312766 -0.214308 -0.280636 0.408443 -0.193125 -0.095276 0.225636 0.045677 -0.266425 -0.194172 0.286257 -0.233906 -0.143375 -0.167858 0.388961 0.313538 -0.203572 -0.274533 -0.145425 -0.109584 -0.187116 0.097205 0.044475 0.093383 0.088856 0.096340 0.098411 0.096430 0.089831 0.142660 0.139574 0.134347 0.143719 0.139912 0.128060 0.144653 0.159837 0.149952 0.124555 0.154671 0.143110 0.158657 0.156635 0.157562
qa: -0.2006 -0.1981 -0.2783 -0.4160 -0.2840 -0.3269 -0.0862 0.1321 0.0585 0.0449 -0.2959 -0.3044 0.3128 -0.2143 -0.2806 0.4084 -0.1931 -0.0953 0.2256 0.0457 -0.2664 -0.1942 0.2863 -0.2339 -0.1434 -0.1679 0.3890 0.3135 -0.2036 -0.2745 -0.1454 -0.1096 -0.1871 0.0972 0.0445 0.0934 0.0889 0.0963 0.0984 0.0964 0.0898 0.1427 0.1396 0.1343 0.1437 0.1399 0.1281 0.1447 0.1598 0.1500 0.1246 0.1547 0.1431 0.1587 0.1566 0.1576
va: 1.0770 1.0521 2.1370 2.0804 2.0401 2.0477 3.1104 3.6519 3.8111 3.4603 3.9309 3.9440 4.2820 3.9781 4.0448 3.7441 3.9930 3.7882 3.7613 3.5992 4.0761 3.8974 3.6814 4.0831 3.8709 3.8626 4.2450 3.6633 3.9155 3.9802 3.8896 3.8820 3.9131 1.0359 1.0284 1.0041 1.0026 1.0111 1.0016 1.0047 1.0024 1.0103 1.0099 1.0222 1.0065 1.0158 1.0279 1.0082 0.9907 1.0078 0.9775 0.9990 1.0123 0.9905 0.9896 0.9904
dispcorr: -0.035430517 hartree
energy: -1560.152737750514
dipole: 21.62185 -22.22048 -0.59863 -10.70025 9.03141 -1.66884 3.22820 -3.69158 -0.46338
magnitude: 1.83251 au
magnitude: 4.65788 debye
