program: Orca
programVersion: 5.0.2
elementType: F F O O O O N C C C C C C C C C C C C C C C C C C C C C C C C C C H H H H H H H H H H H H H H H H H H H H H H H
charge: 0
multiplicity: 1
keywords: wb97x-d3
keywords: def2-TZVPP
keywords: def2/J RIJCOSX
keywords: DEFGRID2
keywords: scfconv7
keywords: smallprint printgap noloewdin
keywords: NOSOSCF
formula: C26H23F2NO4
InChI: InChI=1/C26H23F2NO4/c1-17(2)24(18-11-13-21(14-12-18)32-26(27)28)25(30)33-23(16-29)19-7-6-10-22(15-19)31-20-8-4-3-5-9-20/h3-15,17,23-24,26H,1-2H3
56 atoms
F  -3.168186 -1.402562 -2.352473
F  -4.424426 -2.780094 -1.259154
O  3.242689 0.42891 0.768389
O  3.846705 -0.369791 -1.23351
O  -2.570791 -2.169109 -0.347757
O  -1.445929 2.558366 1.253235
N  3.977374 3.335067 2.194333
C  3.039615 -1.890879 0.465791
C  3.831891 -3.072896 -0.111298
C  1.544526 -1.970629 0.217869
C  5.311206 -2.955466 0.242126
C  3.272256 -4.389127 0.415538
C  3.456278 -0.560613 -0.113375
C  1.0331 -2.014115 -1.074088
C  0.647362 -1.979999 1.28104
C  3.212763 1.759762 0.257802
C  -0.332791 -2.076116 -1.311686
C  -0.717872 -2.054382 1.06478
C  -1.206468 -2.108795 -0.233167
C  1.818781 2.092754 -0.212495
C  0.78123 2.154278 0.709335
C  1.568104 2.266172 -1.566109
C  -0.507962 2.427576 0.276602
C  3.640274 2.62507 1.35716
C  0.271677 2.527895 -1.986689
C  -0.769357 2.620172 -1.076677
C  -3.146233 -2.484273 -1.536015
C  -2.771888 2.29831 1.038743
C  -3.677171 3.128184 1.685741
C  -3.212703 1.219426 0.283641
C  -5.036089 2.872987 1.576559
C  -4.575804 0.981249 0.176186
C  -5.492006 1.803078 0.818534
H  3.200704 -1.862476 1.547689
H  3.730245 -3.066365 -1.200927
H  5.456312 -2.966328 1.325023
H  5.768892 -2.044456 -0.145794
H  5.871149 -3.795928 -0.171076
H  3.859039 -5.229525 0.041587
H  3.305786 -4.424843 1.507352
H  2.238679 -4.554029 0.109676
H  1.698079 -1.992355 -1.928631
H  1.01728 -1.937452 2.298063
H  3.93331 1.89276 -0.554304
H  -0.677781 -2.084925 -2.336617
H  -1.404909 -2.070174 1.9014
H  0.963762 2.010168 1.768625
H  2.374901 2.203931 -2.284868
H  0.067004 2.671585 -3.039351
H  -1.767823 2.848007 -1.426497
H  -2.675758 -3.318382 -2.063443
H  -3.317265 3.961326 2.276696
H  -2.507513 0.569328 -0.215969
H  -5.739509 3.51937 2.085628
H  -4.9205 0.13882 -0.409442
H  -6.552959 1.608735 0.732411
elementType: F O N C H
totalener: -1560.12013038 hartree
nucrepener: 3414.72229566 hartree
electener: -4974.84242605 hartree
oneelecener: -8920.63513948 hartree
twoeener: 3945.79271343 hartree
cpcmener: -0.03607925 hartree
kineticenergy: 1553.63594048 hartree
xcener: -146.815186022824 hartree
chargesum: -0.0000000
charge: -0.219226 -0.205782 -0.276384 -0.421248 -0.296071 -0.320198 -0.086454 0.141673 0.059934 -0.055570 -0.291819 -0.313499 0.323184 -0.212546 -0.145441 0.411829 -0.168409 -0.209596 0.265423 0.043777 -0.287495 -0.192413 0.303925 -0.231262 -0.129139 -0.205903 0.404677 0.313256 -0.253327 -0.202517 -0.120021 -0.143346 -0.188384 0.095756 0.046693 0.088995 0.095242 0.093200 0.098600 0.089750 0.097794 0.141836 0.137319 0.133404 0.140104 0.143832 0.132496 0.144326 0.159923 0.158041 0.159639 0.144760 0.148190 0.157402 0.144127 0.156942
qa: -0.2192 -0.2058 -0.2764 -0.4212 -0.2961 -0.3202 -0.0865 0.1417 0.0599 -0.0556 -0.2918 -0.3135 0.3232 -0.2125 -0.1454 0.4118 -0.1684 -0.2096 0.2654 0.0438 -0.2875 -0.1924 0.3039 -0.2313 -0.1291 -0.2059 0.4047 0.3133 -0.2533 -0.2025 -0.1200 -0.1433 -0.1884 0.0958 0.0467 0.0890 0.0952 0.0932 0.0986 0.0897 0.0978 0.1418 0.1373 0.1334 0.1401 0.1438 0.1325 0.1443 0.1599 0.1580 0.1596 0.1448 0.1482 0.1574 0.1441 0.1569
va: 1.0513 1.0799 2.1502 2.0750 2.0743 2.0937 3.1112 3.6664 3.8065 3.5202 3.9248 3.9510 4.2684 4.0026 3.9477 3.7298 3.9392 3.9790 3.7535 3.6077 4.0460 3.9401 3.7410 4.0838 3.9007 3.9200 4.1944 3.6959 4.0019 3.9034 3.8844 3.9016 3.9365 1.0389 1.0264 1.0021 1.0125 1.0045 1.0046 1.0023 0.9998 1.0199 1.0038 1.0210 1.0164 1.0072 1.0284 1.0083 0.9902 0.9940 0.9723 1.0090 0.9950 0.9888 1.0193 0.9915
dispcorr: -0.033667506 hartree
energy: -1560.153797888956
dipole: 20.22955 -20.67886 -0.44931 -12.69691 10.78388 -1.91303 3.15999 -4.43073 -1.27074
magnitude: 2.34016 au
magnitude: 5.94820 debye
