program: Orca
programVersion: 5.0.2
elementType: F F O O O O N C C C C C C C C C C C C C C C C C C C C C C C C C C H H H H H H H H H H H H H H H H H H H H H H H
charge: 0
multiplicity: 1
keywords: wb97x-d3
keywords: def2-TZVPP
keywords: def2/J RIJCOSX
keywords: DEFGRID2
keywords: scfconv7
keywords: smallprint printgap noloewdin
keywords: NOSOSCF
formula: C26H23F2NO4
InChI: InChI=1/C26H23F2NO4/c1-17(2)24(18-11-13-21(14-12-18)32-26(27)28)25(30)33-23(16-29)19-7-6-10-22(15-19)31-20-8-4-3-5-9-20/h3-15,17,23-24,26H,1-2H3
56 atoms
F  -3.505504 -2.124079 1.82658
F  -3.377703 -3.857777 3.110704
O  2.979454 0.587534 0.086773
O  2.176562 0.329826 -1.983268
O  -1.539719 -2.856052 2.573312
O  -2.510153 1.673082 -0.59509
N  3.77395 3.267791 1.853958
C  2.899006 -1.613921 -0.737562
C  3.07842 -2.428754 -2.024974
C  1.701164 -2.015559 0.105418
C  4.332622 -1.989353 -2.773612
C  3.156163 -3.915926 -1.701925
C  2.669233 -0.144956 -0.996282
C  1.86058 -2.397645 1.433338
C  0.410132 -1.935791 -0.40576
C  2.336493 1.858305 0.192504
C  0.767067 -2.698682 2.227885
C  -0.698464 -2.218221 0.37931
C  -0.51266 -2.598835 1.701241
C  0.92334 1.654758 0.683306
C  -0.132918 1.860869 -0.193269
C  0.699716 1.149249 1.959746
C  -1.427411 1.572773 0.224459
C  3.146061 2.634194 1.130872
C  -0.595789 0.866062 2.359367
C  -1.662636 1.08066 1.500674
C  -2.75895 -3.222428 2.102716
C  -2.578701 2.610625 -1.589469
C  -2.18437 3.92954 -1.400598
C  -3.13634 2.202602 -2.79331
C  -2.346632 4.837404 -2.437676
C  -3.304805 3.12472 -3.815807
C  -2.905999 4.4434 -3.645914
H  3.798648 -1.725149 -0.123817
H  2.210113 -2.261843 -2.66974
H  4.308307 -0.93795 -3.061682
H  4.454275 -2.569606 -3.689678
H  5.226808 -2.146669 -2.165562
H  3.985843 -4.131075 -1.024009
H  2.24257 -4.287646 -1.236852
H  3.316568 -4.49613 -2.612015
H  2.854536 -2.462969 1.8587
H  0.244001 -1.626686 -1.430495
H  2.346127 2.393716 -0.761309
H  0.905581 -2.996965 3.259482
H  -1.683071 -2.102291 -0.053619
H  0.061389 2.228501 -1.193041
H  1.525059 0.97403 2.639082
H  -0.781184 0.473456 3.350385
H  -2.675011 0.857526 1.812796
H  -2.728903 -3.865181 1.219398
H  -1.760479 4.254099 -0.458355
H  -3.443551 1.172115 -2.922394
H  -2.038471 5.864866 -2.292502
H  -3.746684 2.805359 -4.750963
H  -3.03355 5.159758 -4.44674
elementType: F O N C H
totalener: -1560.11851763 hartree
nucrepener: 3413.61802600 hartree
electener: -4973.73654363 hartree
oneelecener: -8918.47429752 hartree
twoeener: 3944.73775389 hartree
cpcmener: -0.03591139 hartree
kineticenergy: 1553.63748065 hartree
xcener: -146.817942558628 hartree
chargesum: 0.0000000
charge: -0.207455 -0.200120 -0.275543 -0.416317 -0.283721 -0.326226 -0.086000 0.137014 0.060792 -0.043010 -0.292498 -0.311352 0.322233 -0.152277 -0.216047 0.404643 -0.201842 -0.169721 0.262035 0.045484 -0.198536 -0.277326 0.332244 -0.233757 -0.066258 -0.279729 0.389115 0.300997 -0.209956 -0.256815 -0.136945 -0.116280 -0.187543 0.098381 0.046194 0.094974 0.092977 0.088579 0.089421 0.098081 0.097432 0.136087 0.141579 0.134901 0.144093 0.144071 0.141269 0.142713 0.157023 0.139245 0.126438 0.156802 0.145359 0.159371 0.157702 0.158023
qa: -0.2075 -0.2001 -0.2755 -0.4163 -0.2837 -0.3262 -0.0860 0.1370 0.0608 -0.0430 -0.2925 -0.3114 0.3222 -0.1523 -0.2160 0.4046 -0.2018 -0.1697 0.2620 0.0455 -0.1985 -0.2773 0.3322 -0.2338 -0.0663 -0.2797 0.3891 0.3010 -0.2100 -0.2568 -0.1369 -0.1163 -0.1875 0.0984 0.0462 0.0950 0.0930 0.0886 0.0894 0.0981 0.0974 0.1361 0.1416 0.1349 0.1441 0.1441 0.1413 0.1427 0.1570 0.1392 0.1264 0.1568 0.1454 0.1594 0.1577 0.1580
va: 1.0514 1.0771 2.1494 2.0788 2.0463 2.0816 3.1127 3.6623 3.8123 3.5060 3.9245 3.9493 4.2726 3.9660 3.9657 3.7447 3.9882 3.8575 3.7407 3.5880 3.9202 3.9688 3.6621 4.0748 3.8146 3.9803 4.2503 3.6804 3.9247 4.0174 3.8837 3.8817 3.9104 1.0363 1.0262 1.0134 1.0046 1.0021 1.0021 1.0002 1.0048 1.0040 1.0193 1.0198 1.0059 1.0124 1.0180 1.0110 0.9907 1.0183 0.9771 0.9979 1.0088 0.9900 0.9894 0.9907
dispcorr: -0.034441772 hartree
energy: -1560.152959399922
dipole: 21.02412 -21.14519 -0.12108 -3.20820 1.83409 -1.37411 -23.94003 22.53652 -1.40351
magnitude: 1.96791 au
magnitude: 5.00203 debye
