program: Orca
programVersion: 5.0.2
elementType: F F O O O O N C C C C C C C C C C C C C C C C C C C C C C C C C C H H H H H H H H H H H H H H H H H H H H H H H
charge: 0
multiplicity: 1
keywords: wb97x-d3
keywords: def2-TZVPP
keywords: def2/J RIJCOSX
keywords: DEFGRID2
keywords: scfconv7
keywords: smallprint printgap noloewdin
keywords: NOSOSCF
formula: C26H23F2NO4
InChI: InChI=1/C26H23F2NO4/c1-17(2)24(18-11-13-21(14-12-18)32-26(27)28)25(30)33-23(16-29)19-7-6-10-22(15-19)31-20-8-4-3-5-9-20/h3-15,17,23-24,26H,1-2H3
56 atoms
F  -3.568891 -3.105473 1.584497
F  -4.771114 -1.650834 0.530665
O  3.372455 0.361275 0.689547
O  3.488294 0.010952 -1.513459
O  -2.742084 -1.9468 -0.127445
O  -1.407184 1.67037 0.67255
N  4.066583 2.817624 2.771919
C  2.929111 -1.828121 -0.037882
C  3.555696 -2.879748 -0.965845
C  1.412645 -1.842522 -0.031712
C  5.076956 -2.852806 -0.858252
C  3.029024 -4.266643 -0.61735
C  3.318159 -0.415818 -0.403651
C  0.709921 -2.050645 1.145657
C  0.686897 -1.643518 -1.205334
C  3.419121 1.763763 0.471539
C  -0.679771 -2.088346 1.170565
C  -0.694534 -1.67357 -1.200439
C  -1.378652 -1.900571 -0.012667
C  2.081967 2.303321 0.014459
C  0.913566 1.754583 0.523597
C  2.032914 3.341229 -0.904373
C  -0.313462 2.246203 0.102619
C  3.785136 2.339617 1.766819
C  0.799023 3.840237 -1.295165
C  -0.379104 3.303688 -0.798085
C  -3.5295 -1.892265 0.976414
C  -2.614324 1.632127 0.028539
C  -2.730197 1.304616 -1.31677
C  -3.742723 1.866187 0.801615
C  -3.993381 1.220856 -1.884473
C  -4.999993 1.768716 0.222204
C  -5.131213 1.452148 -1.122776
H  3.273008 -2.024113 0.982329
H  3.273788 -2.6528 -1.998694
H  5.402075 -3.076527 0.16086
H  5.504367 -1.888281 -1.137453
H  5.522032 -3.601232 -1.515835
H  3.241565 -4.521462 0.424194
H  1.952078 -4.35294 -0.765666
H  3.50361 -5.023624 -1.243565
H  1.248975 -2.203314 2.072858
H  1.196801 -1.468047 -2.144536
H  4.20247 2.034342 -0.244033
H  -1.17287 -2.281769 2.113769
H  -1.248853 -1.529101 -2.119191
H  0.936987 0.949139 1.247878
H  2.946417 3.758013 -1.309532
H  0.749845 4.658215 -2.001971
H  -1.330103 3.712257 -1.11439
H  -3.236641 -1.135929 1.708551
H  -1.851959 1.111945 -1.920039
H  -3.63504 2.117841 1.849657
H  -4.084853 0.966842 -2.932841
H  -5.879185 1.949112 0.82743
H  -6.112301 1.380612 -1.57377
elementType: F O N C H
totalener: -1560.12068791 hartree
nucrepener: 3472.65021901 hartree
electener: -5032.77090692 hartree
oneelecener: -9036.56884663 hartree
twoeener: 4003.79793971 hartree
cpcmener: -0.03755932 hartree
kineticenergy: 1553.64273347 hartree
xcener: -146.819616041699 hartree
chargesum: -0.0000000
charge: -0.211207 -0.195545 -0.277792 -0.417582 -0.268494 -0.322280 -0.084790 0.140757 0.061672 -0.048402 -0.292418 -0.312278 0.316503 -0.221582 -0.142764 0.386920 -0.129207 -0.238149 0.258994 0.048782 -0.271623 -0.202300 0.275012 -0.232291 -0.128104 -0.199445 0.380715 0.372343 -0.257007 -0.293579 -0.118207 -0.100666 -0.196393 0.093281 0.046856 0.089182 0.095004 0.093724 0.089591 0.098171 0.098257 0.138042 0.139844 0.144831 0.138282 0.147403 0.150447 0.143751 0.160003 0.157730 0.125792 0.156332 0.143388 0.157983 0.156253 0.156262
qa: -0.2112 -0.1955 -0.2778 -0.4176 -0.2685 -0.3223 -0.0848 0.1408 0.0617 -0.0484 -0.2924 -0.3123 0.3165 -0.2216 -0.1428 0.3869 -0.1292 -0.2381 0.2590 0.0488 -0.2716 -0.2023 0.2750 -0.2323 -0.1281 -0.1994 0.3807 0.3723 -0.2570 -0.2936 -0.1182 -0.1007 -0.1964 0.0933 0.0469 0.0892 0.0950 0.0937 0.0896 0.0982 0.0983 0.1380 0.1398 0.1448 0.1383 0.1474 0.1504 0.1438 0.1600 0.1577 0.1258 0.1563 0.1434 0.1580 0.1563 0.1563
va: 1.0581 1.0753 2.1379 2.0801 2.0491 2.0463 3.1131 3.6787 3.8072 3.4932 3.9258 3.9510 4.2497 3.9992 3.9394 3.7387 3.8894 3.9862 3.7643 3.6259 4.0313 3.9911 3.7765 4.0808 3.9024 3.9238 4.2576 3.4686 3.9000 4.0054 3.8892 3.8413 3.9198 1.0400 1.0261 1.0023 1.0119 1.0043 1.0022 1.0002 1.0047 1.0063 1.0180 1.0157 1.0152 1.0043 1.0140 1.0021 0.9903 0.9954 0.9724 0.9973 1.0102 0.9900 0.9889 0.9910
dispcorr: -0.036282709 hartree
energy: -1560.156970620958
dipole: 21.33605 -21.48011 -0.14406 -7.67098 7.51798 -0.15300 -11.86389 10.83293 -1.03097
magnitude: 1.05217 au
magnitude: 2.67440 debye
