program: Orca
programVersion: 5.0.2
elementType: F F O O O O N C C C C C C C C C C C C C C C C C C C C C C C C C C H H H H H H H H H H H H H H H H H H H H H H H
charge: 0
multiplicity: 1
keywords: wb97x-d3
keywords: def2-TZVPP
keywords: def2/J RIJCOSX
keywords: DEFGRID2
keywords: scfconv7
keywords: smallprint printgap noloewdin
keywords: NOSOSCF
formula: C26H23F2NO4
InChI: InChI=1/C26H23F2NO4/c1-17(2)24(18-11-13-21(14-12-18)32-26(27)28)25(30)33-23(16-29)19-7-6-10-22(15-19)31-20-8-4-3-5-9-20/h3-15,17,23-24,26H,1-2H3
56 atoms
F  -3.462027 -3.802423 2.456623
F  -4.482985 -1.911674 2.260692
O  2.597702 0.306524 -0.137837
O  3.83354 -0.756374 1.381084
O  -2.845219 -2.331184 0.907428
O  -1.262342 3.20932 -1.755374
N  1.734014 1.433035 2.950406
C  2.687858 -2.039191 -0.326406
C  3.091696 -2.036062 -1.811685
C  1.202793 -2.179537 -0.050747
C  4.5953 -1.823684 -1.958217
C  2.675166 -3.347458 -2.465758
C  3.134599 -0.793503 0.404353
C  0.781128 -2.915685 1.048491
C  0.235443 -1.527128 -0.813828
C  2.759693 1.53834 0.543852
C  -0.560646 -3.001924 1.397728
C  -1.103631 -1.589547 -0.473902
C  -1.498875 -2.318043 0.640486
C  2.018145 2.597102 -0.233876
C  0.698262 2.36554 -0.611485
C  2.649477 3.790531 -0.542686
C  0.010829 3.353802 -1.299505
C  2.197902 1.449392 1.899756
C  1.948971 4.7683 -1.237748
C  0.634997 4.558935 -1.612861
C  -3.271728 -2.488854 2.186037
C  -2.152942 2.333915 -1.192479
C  -2.957022 1.617974 -2.068593
C  -2.323386 2.216257 0.181908
C  -3.948912 0.788668 -1.565269
C  -3.305048 1.365518 0.670706
C  -4.125034 0.655035 -0.195622
H  3.206528 -2.87148 0.157604
H  2.582004 -1.21564 -2.324811
H  5.15775 -2.602916 -1.438993
H  4.925426 -0.858728 -1.568075
H  4.88342 -1.854517 -3.00975
H  3.148352 -4.199705 -1.972994
H  1.596487 -3.502322 -2.433499
H  2.975772 -3.363623 -3.514037
H  1.509207 -3.44173 1.653948
H  0.515912 -0.948734 -1.684339
H  3.817368 1.803292 0.636567
H  -0.841406 -3.610532 2.247116
H  -1.842647 -1.067607 -1.068692
H  0.218519 1.425549 -0.366619
H  3.676734 3.958686 -0.24583
H  2.431938 5.703727 -1.48677
H  0.087925 5.320499 -2.154126
H  -2.607432 -2.059267 2.940396
H  -2.815215 1.722929 -3.137036
H  -1.708637 2.782758 0.870248
H  -4.580661 0.239384 -2.25131
H  -3.435478 1.272103 1.741119
H  -4.894991 0.00309 0.193026
elementType: F O N C H
totalener: -1560.11884027 hartree
nucrepener: 3434.37627291 hartree
electener: -4994.49511318 hartree
oneelecener: -8959.77384849 hartree
twoeener: 3965.27873530 hartree
cpcmener: -0.03808351 hartree
kineticenergy: 1553.64367193 hartree
xcener: -146.819658161571 hartree
chargesum: 0.0000000
charge: -0.209676 -0.202639 -0.266742 -0.409182 -0.281466 -0.320661 -0.087055 0.167570 0.027763 0.014569 -0.295321 -0.293717 0.307436 -0.206364 -0.259851 0.401181 -0.147650 -0.179819 0.215513 -0.002029 -0.231147 -0.206017 0.303651 -0.231124 -0.102283 -0.247782 0.396685 0.310259 -0.256043 -0.205399 -0.104227 -0.130483 -0.205151 0.095801 0.055093 0.094605 0.091185 0.094529 0.090623 0.099997 0.095812 0.140969 0.144827 0.134307 0.145308 0.174470 0.139856 0.144952 0.158569 0.146193 0.125806 0.143356 0.156386 0.155780 0.156449 0.152329
qa: -0.2097 -0.2026 -0.2667 -0.4092 -0.2815 -0.3207 -0.0871 0.1676 0.0278 0.0146 -0.2953 -0.2937 0.3074 -0.2064 -0.2599 0.4012 -0.1477 -0.1798 0.2155 -0.0020 -0.2311 -0.2060 0.3037 -0.2311 -0.1023 -0.2478 0.3967 0.3103 -0.2560 -0.2054 -0.1042 -0.1305 -0.2052 0.0958 0.0551 0.0946 0.0912 0.0945 0.0906 0.1000 0.0958 0.1410 0.1448 0.1343 0.1453 0.1745 0.1399 0.1450 0.1586 0.1462 0.1258 0.1434 0.1564 0.1558 0.1564 0.1523
va: 1.0545 1.0715 2.1490 2.0931 2.0569 2.1021 3.1090 3.6244 3.8399 3.5543 3.9396 3.9283 4.2422 4.0485 3.9826 3.7549 3.8822 3.9253 3.8921 3.7558 3.9642 3.9533 3.7428 4.0195 3.8978 3.9997 4.2298 3.6414 4.0016 3.9097 3.8549 3.8206 3.8567 1.0290 1.0231 1.0037 1.0093 1.0037 1.0022 1.0020 1.0054 1.0069 1.0085 1.0167 1.0120 0.9900 1.0133 1.0030 0.9895 1.0076 0.9789 1.0094 0.9977 0.9908 0.9933 1.0067
dispcorr: -0.034574501 hartree
energy: -1560.153414771268
dipole: 24.22681 -23.02533 1.20148 -1.56103 1.98492 0.42389 -21.65649 19.60289 -2.05359
magnitude: 2.41671 au
magnitude: 6.14279 debye
