program: Orca
programVersion: 5.0.2
elementType: F F O O O O N C C C C C C C C C C C C C C C C C C C C C C C C C C H H H H H H H H H H H H H H H H H H H H H H H
charge: 0
multiplicity: 1
keywords: wb97x-d3
keywords: def2-TZVPP
keywords: def2/J RIJCOSX
keywords: DEFGRID2
keywords: scfconv7
keywords: smallprint printgap noloewdin
keywords: NOSOSCF
formula: C26H23F2NO4
InChI: InChI=1/C26H23F2NO4/c1-17(2)24(18-11-13-21(14-12-18)32-26(27)28)25(30)33-23(16-29)19-7-6-10-22(15-19)31-20-8-4-3-5-9-20/h3-15,17,23-24,26H,1-2H3
56 atoms
F  -3.350256 -3.588386 0.871943
F  -3.703744 -2.574905 -0.997449
O  3.260695 0.36195 0.731224
O  3.338282 -0.084501 -1.455396
O  -2.850601 -1.417635 0.722421
O  -1.435674 2.192598 0.901641
N  4.1563 2.849425 2.697603
C  2.777958 -1.848681 0.112012
C  3.282469 -2.945591 -0.836508
C  1.268739 -1.792823 0.254119
C  4.807305 -2.979331 -0.855439
C  2.734756 -4.302096 -0.409221
C  3.179622 -0.460191 -0.325584
C  0.669957 -1.942493 1.49951
C  0.458366 -1.544087 -0.850564
C  3.378785 1.749855 0.458206
C  -0.706999 -1.853728 1.643693
C  -0.917538 -1.446875 -0.719899
C  -1.492908 -1.59744 0.53314
C  2.068416 2.362024 0.015632
C  0.878165 1.966039 0.615001
C  2.067795 3.337597 -0.969823
C  -0.309402 2.56756 0.229969
C  3.815826 2.350237 1.720547
C  0.871346 3.93825 -1.336844
C  -0.320986 3.565117 -0.738623
C  -3.706914 -2.393915 0.345516
C  -2.593867 1.882898 0.24864
C  -3.751144 1.930306 1.016752
C  -2.64476 1.475694 -1.078481
C  -4.961496 1.553154 0.457118
C  -3.866403 1.106114 -1.625624
C  -5.027568 1.139173 -0.867049
H  3.203314 -2.03113 1.103816
H  2.922334 -2.731789 -1.847412
H  5.165606 -3.757467 -1.53114
H  5.205008 -3.199558 0.138217
H  5.248653 -2.038943 -1.187913
H  3.129524 -5.091122 -1.051156
H  3.021988 -4.539696 0.618164
H  1.646955 -4.349347 -0.469116
H  1.282704 -2.131804 2.372306
H  0.894502 -1.413748 -1.833288
H  4.157445 1.946943 -0.286089
H  -1.162239 -1.962212 2.619875
H  -1.522427 -1.226056 -1.58778
H  0.860074 1.205475 1.386932
H  2.994623 3.633422 -1.444786
H  0.866412 4.708671 -2.096514
H  -1.246614 4.049657 -1.022941
H  -4.709274 -2.125256 0.67327
H  -3.697286 2.248326 2.050635
H  -1.750776 1.424684 -1.685797
H  -5.85855 1.588552 1.06192
H  -3.901946 0.783217 -2.658258
H  -5.974162 0.848343 -1.303069
elementType: F O N C H
totalener: -1560.11913666 hartree
nucrepener: 3482.78948361 hartree
electener: -5042.90862027 hartree
oneelecener: -9057.62887333 hartree
twoeener: 4014.72025306 hartree
cpcmener: -0.03676609 hartree
kineticenergy: 1553.65662164 hartree
xcener: -146.820204386153 hartree
chargesum: -0.0000000
charge: -0.213762 -0.216520 -0.275200 -0.417267 -0.329839 -0.322120 -0.086007 0.139561 0.062840 -0.044007 -0.291968 -0.313240 0.317617 -0.175973 -0.157973 0.386446 -0.167946 -0.200136 0.248167 0.057000 -0.266602 -0.193045 0.260450 -0.230684 -0.121039 -0.194349 0.429445 0.355886 -0.278493 -0.220288 -0.109746 -0.162969 -0.199963 0.096580 0.047812 0.093602 0.089310 0.094151 0.098332 0.089711 0.098556 0.136804 0.140926 0.144658 0.147666 0.152304 0.146459 0.145129 0.160530 0.159902 0.124866 0.142015 0.153719 0.155861 0.156722 0.156111
qa: -0.2138 -0.2165 -0.2752 -0.4173 -0.3298 -0.3221 -0.0860 0.1396 0.0628 -0.0440 -0.2920 -0.3132 0.3176 -0.1760 -0.1580 0.3864 -0.1679 -0.2001 0.2482 0.0570 -0.2666 -0.1930 0.2605 -0.2307 -0.1210 -0.1943 0.4294 0.3559 -0.2785 -0.2203 -0.1097 -0.1630 -0.2000 0.0966 0.0478 0.0936 0.0893 0.0942 0.0983 0.0897 0.0986 0.1368 0.1409 0.1447 0.1477 0.1523 0.1465 0.1451 0.1605 0.1599 0.1249 0.1420 0.1537 0.1559 0.1567 0.1561
va: 1.0668 1.0568 2.1429 2.0800 2.0271 2.0611 3.1126 3.6770 3.8079 3.4756 3.9257 3.9508 4.2503 3.9484 3.9421 3.7380 4.0601 4.0288 3.6342 3.6009 4.0472 3.9845 3.7587 4.0829 3.8849 3.9410 4.2407 3.5454 4.0097 3.8370 3.8660 3.8995 3.8946 1.0380 1.0259 1.0045 1.0021 1.0132 1.0045 1.0021 1.0004 1.0048 1.0193 1.0161 1.0023 1.0004 1.0145 1.0018 0.9900 0.9941 0.9786 1.0112 0.9982 0.9895 0.9917 0.9910
dispcorr: -0.036332058 hartree
energy: -1560.155468714103
dipole: 16.89521 -17.63659 -0.74138 -7.33541 6.82449 -0.51092 -8.40189 7.25475 -1.14715
magnitude: 1.45830 au
magnitude: 3.70670 debye
