program: Orca
programVersion: 5.0.2
elementType: F F O O O O N C C C C C C C C C C C C C C C C C C C C C C C C C C H H H H H H H H H H H H H H H H H H H H H H H
charge: 0
multiplicity: 1
keywords: wb97x-d3
keywords: def2-TZVPP
keywords: def2/J RIJCOSX
keywords: DEFGRID2
keywords: scfconv7
keywords: smallprint printgap noloewdin
keywords: NOSOSCF
formula: C26H23F2NO4
InChI: InChI=1/C26H23F2NO4/c1-17(2)24(18-11-13-21(14-12-18)32-26(27)28)25(30)33-23(16-29)19-7-6-10-22(15-19)31-20-8-4-3-5-9-20/h3-15,17,23-24,26H,1-2H3
56 atoms
F  -3.122729 -1.062639 1.495955
F  -3.478177 -3.194453 1.451516
O  3.120424 0.24054 0.885698
O  3.636549 0.052936 -1.279974
O  -2.593771 -2.209358 -0.355819
O  -1.638058 1.135415 -0.274324
N  3.118027 2.594933 3.194097
C  3.070744 -1.932702 -0.003838
C  3.841543 -2.848199 -0.964567
C  1.562739 -2.06715 -0.086492
C  5.345259 -2.712026 -0.748262
C  3.413985 -4.296876 -0.759185
C  3.341144 -0.465053 -0.235398
C  0.82295 -2.409702 1.036055
C  0.879252 -1.801757 -1.27083
C  3.07003 1.653062 0.757274
C  -0.564104 -2.482386 1.00444
C  -0.502127 -1.854702 -1.318094
C  -1.224308 -2.187087 -0.179349
C  1.81694 2.130095 0.056003
C  0.619525 1.451111 0.233379
C  1.873175 3.268283 -0.736098
C  -0.520641 1.902357 -0.417124
C  3.095199 2.161745 2.128977
C  0.718122 3.722308 -1.355292
C  -0.482197 3.043446 -1.209953
C  -3.465486 -2.081095 0.677595
C  -2.884864 1.704757 -0.328859
C  -3.226654 2.76827 0.495578
C  -3.814923 1.140765 -1.188469
C  -4.520734 3.266629 0.45392
C  -5.108726 1.644013 -1.213886
C  -5.465979 2.708183 -0.397241
H  3.373594 -2.17695 1.01918
H  3.605484 -2.560937 -1.993655
H  5.617363 -2.994648 0.271276
H  5.708287 -1.698204 -0.919616
H  5.890514 -3.368379 -1.42773
H  3.99324 -4.958758 -1.40406
H  3.580052 -4.613236 0.273296
H  2.360664 -4.454979 -0.991039
H  1.331587 -2.627547 1.966919
H  1.419426 -1.532973 -2.17024
H  3.958129 2.040542 0.247195
H  -1.081703 -2.773984 1.906239
H  -1.024334 -1.627398 -2.238909
H  0.555118 0.568942 0.859627
H  2.810112 3.793087 -0.871762
H  0.753959 4.606932 -1.976625
H  -1.367845 3.39835 -1.721047
H  -4.460805 -1.913529 0.270547
H  -2.497409 3.198208 1.17109
H  -3.53395 0.312346 -1.826424
H  -4.791502 4.092337 1.098548
H  -5.836601 1.202389 -1.881905
H  -6.474614 3.098527 -0.420628
elementType: F O N C H
totalener: -1560.10552363 hartree
nucrepener: 3461.67237404 hartree
electener: -5021.77789767 hartree
oneelecener: -9015.84595641 hartree
twoeener: 3994.06805874 hartree
cpcmener: -0.04252000 hartree
kineticenergy: 1553.61920972 hartree
xcener: -146.815389267245 hartree
chargesum: 0.0000000
charge: -0.212312 -0.217140 -0.278258 -0.440928 -0.319197 -0.315844 -0.099062 0.139025 0.066126 -0.065034 -0.294056 -0.315159 0.338714 -0.208491 -0.135182 0.392725 -0.146045 -0.232163 0.254420 0.055997 -0.290773 -0.211703 0.274839 -0.226311 -0.123705 -0.201595 0.442653 0.256246 -0.182878 -0.240730 -0.153032 -0.133120 -0.168684 0.097936 0.045614 0.089216 0.094075 0.093846 0.098505 0.091411 0.097904 0.140037 0.144129 0.149390 0.137131 0.151306 0.155393 0.147253 0.163464 0.158361 0.139212 0.161184 0.149494 0.162096 0.161861 0.161839
qa: -0.2123 -0.2171 -0.2783 -0.4409 -0.3192 -0.3158 -0.0991 0.1390 0.0661 -0.0650 -0.2941 -0.3152 0.3387 -0.2085 -0.1352 0.3927 -0.1460 -0.2322 0.2544 0.0560 -0.2908 -0.2117 0.2748 -0.2263 -0.1237 -0.2016 0.4427 0.2562 -0.1829 -0.2407 -0.1530 -0.1331 -0.1687 0.0979 0.0456 0.0892 0.0941 0.0938 0.0985 0.0914 0.0979 0.1400 0.1441 0.1494 0.1371 0.1513 0.1554 0.1473 0.1635 0.1584 0.1392 0.1612 0.1495 0.1621 0.1619 0.1618
va: 1.0656 1.0657 2.1418 2.0516 2.0896 2.0371 3.1114 3.6704 3.8048 3.4821 3.9262 3.9506 4.2217 4.0248 3.9006 3.7228 3.9518 3.9719 3.7130 3.5960 4.0556 3.9813 3.7482 4.0906 3.8930 3.9369 4.2086 3.6103 3.9438 3.9597 3.8975 3.8793 3.8856 1.0382 1.0267 1.0018 1.0131 1.0043 1.0046 1.0016 1.0001 1.0063 1.0146 1.0140 1.0291 1.0024 1.0077 1.0013 0.9889 0.9971 0.9761 0.9961 1.0119 0.9888 0.9890 0.9883
dispcorr: -0.035176503 hartree
energy: -1560.140700129684
dipole: 19.50888 -20.26404 -0.75516 -6.23542 6.00670 -0.22872 -13.11242 11.56209 -1.55033
magnitude: 1.73957 au
magnitude: 4.42163 debye
