program: Orca
programVersion: 5.0.2
elementType: F F O O O O N C C C C C C C C C C C C C C C C C C C C C C C C C C H H H H H H H H H H H H H H H H H H H H H H H
charge: 0
multiplicity: 1
keywords: wb97x-d3
keywords: def2-TZVPP
keywords: def2/J RIJCOSX
keywords: DEFGRID2
keywords: scfconv7
keywords: smallprint printgap noloewdin
keywords: NOSOSCF
formula: C26H23F2NO4
InChI: InChI=1/C26H23F2NO4/c1-17(2)24(18-11-13-21(14-12-18)32-26(27)28)25(30)33-23(16-29)19-7-6-10-22(15-19)31-20-8-4-3-5-9-20/h3-15,17,23-24,26H,1-2H3
56 atoms
F  -4.09612 -2.242132 -1.400766
F  -4.782231 -2.919049 0.527953
O  3.386769 0.408049 0.716234
O  3.105193 -0.085846 -1.444636
O  -2.944538 -1.77187 0.451897
O  -1.287394 2.041879 1.199432
N  4.567419 2.937668 2.476007
C  2.729891 -1.800124 0.218845
C  3.370787 -2.923846 -0.60997
C  1.212695 -1.81491 0.249712
C  4.8918 -2.822852 -0.557061
C  2.916528 -4.280634 -0.087389
C  3.107526 -0.431311 -0.292306
C  0.539535 -1.649133 1.455802
C  0.461496 -1.946917 -0.914333
C  3.492516 1.785825 0.391252
C  -0.845506 -1.6381 1.508778
C  -0.925401 -1.940578 -0.87906
C  -1.572071 -1.797775 0.340317
C  2.143918 2.406675 0.103421
C  1.014698 1.94225 0.765181
C  2.04687 3.443728 -0.811513
C  -0.214369 2.52029 0.496242
C  4.093093 2.413187 1.568746
C  0.812138 4.033091 -1.046182
C  -0.324706 3.579855 -0.395939
C  -3.671491 -2.715205 -0.20443
C  -2.452094 1.701591 0.56427
C  -2.53271 1.408694 -0.791888
C  -3.577975 1.611022 1.373378
C  -3.758541 1.042569 -1.33148
C  -4.791846 1.234052 0.819881
C  -4.892066 0.954778 -0.536207
H  3.087008 -1.89483 1.247986
H  3.052407 -2.827251 -1.652031
H  5.268638 -1.888021 -0.975038
H  5.348752 -3.633676 -1.125355
H  5.251269 -2.897712 0.471478
H  3.1948 -4.408966 0.961205
H  1.837618 -4.415776 -0.165088
H  3.388449 -5.083655 -0.65485
H  1.102791 -1.536201 2.374001
H  0.949823 -2.060433 -1.87382
H  4.173367 1.951487 -0.450063
H  -1.35758 -1.517448 2.454639
H  -1.479241 -2.03496 -1.80392
H  1.072576 1.139626 1.489563
H  2.928075 3.792851 -1.334531
H  0.731458 4.851807 -1.748238
H  -1.282805 4.045867 -0.586975
H  -3.144109 -3.658428 -0.362006
H  -1.660769 1.450796 -1.430623
H  -3.50075 1.832614 2.430215
H  -3.818709 0.81843 -2.388099
H  -5.664054 1.164591 1.456546
H  -5.841898 0.668383 -0.96708
elementType: F O N C H
totalener: -1560.10647892 hartree
nucrepener: 3473.98607424 hartree
electener: -5034.09255315 hartree
oneelecener: -9039.98518923 hartree
twoeener: 4005.89263608 hartree
cpcmener: -0.04625668 hartree
kineticenergy: 1553.63154965 hartree
xcener: -146.818341360309 hartree
chargesum: -0.0000000
charge: -0.213450 -0.210249 -0.277774 -0.447354 -0.310235 -0.337450 -0.099580 0.151331 0.059943 0.009576 -0.297592 -0.310167 0.324798 -0.196468 -0.190118 0.395479 -0.223633 -0.172792 0.248250 0.026283 -0.244896 -0.202029 0.248085 -0.221557 -0.116072 -0.198135 0.400039 0.346136 -0.204260 -0.271138 -0.167077 -0.115646 -0.205281 0.091474 0.052589 0.095089 0.094717 0.092388 0.091793 0.098880 0.097482 0.145305 0.147174 0.150482 0.147204 0.149048 0.168568 0.149566 0.164201 0.162478 0.150722 0.153725 0.145003 0.157518 0.158857 0.158769
qa: -0.2135 -0.2102 -0.2778 -0.4474 -0.3102 -0.3375 -0.0996 0.1513 0.0599 0.0096 -0.2976 -0.3102 0.3248 -0.1965 -0.1901 0.3955 -0.2236 -0.1728 0.2482 0.0263 -0.2449 -0.2020 0.2481 -0.2216 -0.1161 -0.1981 0.4000 0.3461 -0.2043 -0.2711 -0.1671 -0.1156 -0.2053 0.0915 0.0526 0.0951 0.0947 0.0924 0.0918 0.0989 0.0975 0.1453 0.1472 0.1505 0.1472 0.1490 0.1686 0.1496 0.1642 0.1625 0.1507 0.1537 0.1450 0.1575 0.1589 0.1588
va: 1.0524 1.0675 2.1364 2.0458 2.0118 2.0395 3.1107 3.6548 3.8090 3.4754 3.9299 3.9454 4.2237 3.9390 3.9955 3.7253 3.9796 3.9560 3.7074 3.6410 4.0425 3.9895 3.7646 4.0841 3.8700 3.9425 4.2226 3.5413 3.8142 3.9931 3.8757 3.8736 3.8706 1.0405 1.0255 1.0106 1.0033 1.0026 1.0018 1.0005 1.0046 1.0015 1.0124 1.0143 1.0056 1.0143 1.0078 1.0008 0.9882 0.9930 0.9741 1.0025 1.0098 0.9924 0.9883 0.9902
dispcorr: -0.036279756 hartree
energy: -1560.142758672168
dipole: 21.75627 -21.44567 0.31060 -9.81632 8.37405 -1.44227 -5.48177 4.18522 -1.29655
magnitude: 1.96409 au
magnitude: 4.99233 debye
