program: Orca
programVersion: 5.0.2
elementType: F F O O O O N C C C C C C C C C C C C C C C C C C C C C C C C C C H H H H H H H H H H H H H H H H H H H H H H H
charge: 0
multiplicity: 1
keywords: wb97x-d3
keywords: def2-TZVPP
keywords: def2/J RIJCOSX
keywords: DEFGRID2
keywords: scfconv7
keywords: smallprint printgap noloewdin
keywords: NOSOSCF
formula: C26H23F2NO4
InChI: InChI=1/C26H23F2NO4/c1-17(2)24(18-11-13-21(14-12-18)32-26(27)28)25(30)33-23(16-29)19-7-6-10-22(15-19)31-20-8-4-3-5-9-20/h3-15,17,23-24,26H,1-2H3
56 atoms
F  -3.886004 -1.298284 0.470137
F  -3.023643 -0.202191 2.113468
O  3.120651 0.470778 -0.034564
O  1.849224 0.073156 -1.837393
O  -2.595945 -2.393543 1.940941
O  -2.018323 2.601555 0.162308
N  4.880102 3.10411 0.929377
C  2.529917 -1.777315 -0.448856
C  2.926559 -2.712101 -1.598754
C  1.163277 -2.00978 0.173459
C  4.288716 -2.311013 -2.156998
C  2.965735 -4.156386 -1.11593
C  2.467364 -0.331484 -0.887472
C  0.946784 -1.614939 1.491473
C  0.090267 -2.517654 -0.552942
C  2.811686 1.866995 -0.074343
C  -0.308589 -1.711014 2.071665
C  -1.165338 -2.643343 0.02338
C  -1.357016 -2.230242 1.331345
C  1.560526 2.103727 0.731733
C  0.370018 2.332547 0.060736
C  1.576626 1.960877 2.116108
C  -0.816756 2.380857 0.780761
C  3.974714 2.546464 0.491767
C  0.389558 2.053091 2.822978
C  -0.814275 2.246532 2.159616
C  -3.521785 -1.412659 1.769002
C  -2.340563 1.895758 -0.971112
C  -1.835872 0.6297 -1.240319
C  -3.247928 2.493765 -1.835622
C  -2.238324 -0.0281 -2.393917
C  -3.649192 1.81797 -2.978623
C  -3.142453 0.557912 -3.268582
H  3.282806 -1.871982 0.338486
H  2.191168 -2.627973 -2.403949
H  4.290101 -1.307058 -2.584806
H  4.591706 -2.995837 -2.949658
H  5.055973 -2.344493 -1.380443
H  3.684116 -4.274394 -0.301504
H  1.997635 -4.505248 -0.756979
H  3.271964 -4.819907 -1.925424
H  1.767959 -1.222834 2.078788
H  0.218156 -2.831353 -1.580525
H  2.69314 2.222928 -1.101583
H  -0.459987 -1.404335 3.098358
H  -1.980471 -3.068953 -0.546287
H  0.368436 2.453663 -1.015299
H  2.504523 1.776264 2.64368
H  0.393967 1.950391 3.899577
H  -1.74317 2.300984 2.711755
H  -4.393921 -1.6434 2.376362
H  -1.141616 0.146615 -0.565364
H  -3.639489 3.478067 -1.611894
H  -1.841593 -1.013828 -2.600981
H  -4.358092 2.286739 -3.648315
H  -3.451827 0.037168 -4.164731
elementType: F O N C H
totalener: -1560.10438422 hartree
nucrepener: 3563.65003408 hartree
electener: -5123.75441830 hartree
oneelecener: -9219.52675018 hartree
twoeener: 4095.77233188 hartree
cpcmener: -0.04311135 hartree
kineticenergy: 1553.62631523 hartree
xcener: -146.815234331568 hartree
chargesum: 0.0000000
charge: -0.217605 -0.212798 -0.267898 -0.450079 -0.343313 -0.339409 -0.098690 0.139006 0.078559 0.108604 -0.302910 -0.306788 0.315943 -0.259916 -0.230645 0.407336 -0.187198 -0.221809 0.275359 0.032262 -0.184729 -0.231242 0.302015 -0.221384 -0.119596 -0.241008 0.420549 0.300880 -0.150042 -0.252419 -0.156597 -0.130880 -0.192030 0.094584 0.044820 0.096133 0.094930 0.094491 0.092414 0.100877 0.096931 0.150620 0.154054 0.138403 0.151021 0.151910 0.147614 0.143439 0.162699 0.144864 0.153340 0.098218 0.147110 0.158463 0.161088 0.160448
qa: -0.2176 -0.2128 -0.2679 -0.4501 -0.3433 -0.3394 -0.0987 0.1390 0.0786 0.1086 -0.3029 -0.3068 0.3159 -0.2599 -0.2306 0.4073 -0.1872 -0.2218 0.2754 0.0323 -0.1847 -0.2312 0.3020 -0.2214 -0.1196 -0.2410 0.4205 0.3009 -0.1500 -0.2524 -0.1566 -0.1309 -0.1920 0.0946 0.0448 0.0961 0.0949 0.0945 0.0924 0.1009 0.0969 0.1506 0.1541 0.1384 0.1510 0.1519 0.1476 0.1434 0.1627 0.1449 0.1533 0.0982 0.1471 0.1585 0.1611 0.1604
va: 1.0646 1.0718 2.1457 2.0398 2.0665 2.0731 3.1091 3.6951 3.7910 3.5007 3.9325 3.9453 4.2438 3.9635 3.9006 3.7459 3.9499 3.9671 3.6519 3.5697 3.9179 3.9416 3.6741 4.0803 3.8688 3.9853 4.2121 3.7201 3.7884 3.9876 3.8800 3.8937 3.9309 1.0365 1.0293 1.0102 1.0027 1.0030 1.0016 1.0014 1.0043 1.0038 0.9982 1.0191 1.0023 1.0041 1.0119 1.0095 0.9881 1.0116 0.9714 1.0296 1.0083 0.9934 0.9871 0.9898
dispcorr: -0.038409247 hartree
energy: -1560.142793470073
dipole: 18.92613 -19.64504 -0.71891 -16.70028 14.84662 -1.85365 -14.14680 14.39547 0.24867
magnitude: 2.00367 au
magnitude: 5.09293 debye
