program: Orca
programVersion: 5.0.2
elementType: F F O O O O N C C C C C C C C C C C C C C C C C C C C C C C C C C H H H H H H H H H H H H H H H H H H H H H H H
charge: 0
multiplicity: 1
keywords: wb97x-d3
keywords: def2-TZVPP
keywords: def2/J RIJCOSX
keywords: DEFGRID2
keywords: scfconv7
keywords: smallprint printgap noloewdin
keywords: NOSOSCF
formula: C26H23F2NO4
InChI: InChI=1/C26H23F2NO4/c1-17(2)24(18-11-13-21(14-12-18)32-26(27)28)25(30)33-23(16-29)19-7-6-10-22(15-19)31-20-8-4-3-5-9-20/h3-15,17,23-24,26H,1-2H3
56 atoms
F  -2.820387 -2.643228 -3.096934
F  -2.80372 -0.521036 -2.684863
O  2.734904 0.508502 1.030984
O  3.770877 -0.263679 -0.794014
O  -2.751362 -1.95269 -0.966105
O  -2.178798 1.50484 -0.343793
N  2.486605 3.483444 2.455957
C  2.678914 -1.81637 0.70874
C  3.547032 -2.98845 0.233216
C  1.239911 -1.870686 0.2299
C  4.958765 -2.878955 0.800158
C  2.916887 -4.310329 0.655457
C  3.167075 -0.475326 0.224506
C  0.187061 -1.894986 1.136687
C  0.937856 -1.850647 -1.127189
C  2.66646 1.81195 0.457076
C  -1.127405 -1.914766 0.701155
C  -0.371889 -1.867417 -1.583677
C  -1.407179 -1.903752 -0.658443
C  1.465375 1.916053 -0.450849
C  0.19885 1.673176 0.07428
C  1.636735 2.192216 -1.797942
C  -0.903999 1.747324 -0.761978
C  2.563711 2.733688 1.587511
C  0.523058 2.24384 -2.626173
C  -0.744761 2.031169 -2.115268
C  -3.235973 -1.709433 -2.209029
C  -2.571309 1.736311 0.949784
C  -2.200808 2.87811 1.650328
C  -3.435472 0.808027 1.51296
C  -2.691317 3.071439 2.934296
C  -3.927889 1.021714 2.792403
C  -3.554198 2.148763 3.511078
H  2.67255 -1.810092 1.803183
H  3.602816 -2.966791 -0.859382
H  4.940649 -2.89343 1.892229
H  5.470566 -1.968342 0.487841
H  5.568935 -3.720831 0.470791
H  2.792104 -4.357486 1.739931
H  1.938985 -4.468744 0.200257
H  3.553158 -5.145775 0.360781
H  0.390689 -1.900417 2.200131
H  1.73067 -1.824319 -1.864389
H  3.583181 2.065586 -0.083992
H  -1.937188 -1.942267 1.419039
H  -0.536899 -1.860894 -2.650237
H  0.082535 1.43436 1.124889
H  2.626519 2.368954 -2.19786
H  0.643206 2.457276 -3.679652
H  -1.612225 2.087923 -2.75964
H  -4.323034 -1.71555 -2.158748
H  -1.54145 3.614116 1.207978
H  -3.728599 -0.069235 0.950963
H  -2.399734 3.958019 3.48194
H  -4.604764 0.298114 3.227164
H  -3.935483 2.309795 4.510496
elementType: F O N C H
totalener: -1560.10500054 hartree
nucrepener: 3530.24049591 hartree
electener: -5090.34549645 hartree
oneelecener: -9152.90502061 hartree
twoeener: 4062.55952416 hartree
cpcmener: -0.04040914 hartree
kineticenergy: 1553.63137256 hartree
xcener: -146.818986376337 hartree
chargesum: -0.0000000
charge: -0.216791 -0.209884 -0.286953 -0.439594 -0.312641 -0.330164 -0.099873 0.139401 0.059532 -0.039947 -0.293794 -0.315254 0.335322 -0.155300 -0.220897 0.434058 -0.216679 -0.184657 0.302767 0.048078 -0.260612 -0.201072 0.300340 -0.234406 -0.099877 -0.266852 0.434811 0.339928 -0.220278 -0.299623 -0.140164 -0.112307 -0.195167 0.099501 0.046794 0.089757 0.095163 0.093884 0.090767 0.097565 0.099246 0.139263 0.141598 0.142988 0.149423 0.131134 0.146301 0.149432 0.161582 0.144397 0.140272 0.157595 0.156058 0.162438 0.162188 0.161200
qa: -0.2168 -0.2099 -0.2870 -0.4396 -0.3126 -0.3302 -0.0999 0.1394 0.0595 -0.0399 -0.2938 -0.3153 0.3353 -0.1553 -0.2209 0.4341 -0.2167 -0.1847 0.3028 0.0481 -0.2606 -0.2011 0.3003 -0.2344 -0.0999 -0.2669 0.4348 0.3399 -0.2203 -0.2996 -0.1402 -0.1123 -0.1952 0.0995 0.0468 0.0898 0.0952 0.0939 0.0908 0.0976 0.0992 0.1393 0.1416 0.1430 0.1494 0.1311 0.1463 0.1494 0.1616 0.1444 0.1403 0.1576 0.1561 0.1624 0.1622 0.1612
va: 1.0666 1.0735 2.1472 2.0526 2.1037 2.0420 3.1089 3.6602 3.8098 3.5007 3.9228 3.9520 4.2712 3.9393 3.9668 3.7247 3.9407 3.9419 3.6353 3.5928 3.9562 3.9547 3.6063 4.0906 3.8918 4.0103 4.2194 3.6381 3.9304 3.9725 3.8795 3.8874 3.9170 1.0384 1.0259 1.0019 1.0131 1.0043 1.0017 1.0002 1.0043 1.0038 1.0198 1.0161 1.0016 1.0349 1.0143 1.0047 0.9876 1.0146 0.9739 0.9983 1.0106 0.9888 0.9893 0.9893
dispcorr: -0.037241618 hartree
energy: -1560.142242156031
dipole: 19.36483 -20.00631 -0.64149 -12.09536 10.94378 -1.15158 13.70698 -13.86518 -0.15820
magnitude: 1.32766 au
magnitude: 3.37464 debye
