program: Orca
programVersion: 5.0.2
elementType: F F O O O O N C C C C C C C C C C C C C C C C C C C C C C C C C C H H H H H H H H H H H H H H H H H H H H H H H
charge: 0
multiplicity: 1
keywords: wb97x-d3
keywords: def2-TZVPP
keywords: def2/J RIJCOSX
keywords: DEFGRID2
keywords: scfconv7
keywords: smallprint printgap noloewdin
keywords: NOSOSCF
formula: C26H23F2NO4
InChI: InChI=1/C26H23F2NO4/c1-17(2)24(18-11-13-21(14-12-18)32-26(27)28)25(30)33-23(16-29)19-7-6-10-22(15-19)31-20-8-4-3-5-9-20/h3-15,17,23-24,26H,1-2H3
56 atoms
F  -3.087621 -2.968428 -1.643197
F  -3.059401 -0.80136 -1.634627
O  3.282414 0.402623 0.817815
O  3.853419 -0.293858 -1.230102
O  -2.51448 -1.903668 0.235805
O  -1.74335 1.316166 0.897103
N  3.338541 3.292029 2.399048
C  3.162164 -1.910111 0.436129
C  3.86758 -3.059847 -0.292657
C  1.647697 -1.946646 0.34483
C  5.377789 -2.977762 -0.098618
C  3.347269 -4.398518 0.217993
C  3.512967 -0.546845 -0.104692
C  0.865611 -1.950336 1.494055
C  1.005777 -1.916612 -0.887647
C  3.04381 1.724022 0.331128
C  -0.51602 -1.938756 1.413982
C  -0.377984 -1.904764 -0.98939
C  -1.137822 -1.91635 0.1735
C  1.653114 1.804713 -0.248815
C  0.553497 1.601738 0.578171
C  1.480565 1.991776 -1.612088
C  -0.720087 1.582132 0.033008
C  3.206615 2.593586 1.494913
C  0.198524 1.967406 -2.144488
C  -0.905275 1.754244 -1.335437
C  -3.307567 -1.885094 -0.861332
C  -2.982207 1.881689 0.743348
C  -4.06591 1.117839 1.156677
C  -3.166819 3.176392 0.274061
C  -5.344335 1.650792 1.088062
C  -4.453968 3.691225 0.19973
C  -5.546875 2.935052 0.600863
H  3.438202 -1.946282 1.494512
H  3.645662 -2.990045 -1.361839
H  5.874983 -3.7978 -0.618311
H  5.638028 -3.052646 0.959596
H  5.803209 -2.049463 -0.480561
H  3.504979 -4.497327 1.294472
H  2.28268 -4.531226 0.024067
H  3.872674 -5.220822 -0.269088
H  1.337899 -1.962058 2.468316
H  1.582107 -1.902189 -1.80444
H  3.791523 2.02393 -0.408931
H  -1.115198 -1.941877 2.315595
H  -0.812083 -1.880169 -1.977079
H  0.676049 1.453875 1.645238
H  2.336013 2.15099 -2.255087
H  0.055541 2.102207 -3.208096
H  -1.89381 1.728696 -1.773365
H  -4.346097 -1.871608 -0.538856
H  -3.908635 0.119276 1.542901
H  -2.325857 3.786766 -0.029015
H  -6.185204 1.052544 1.413628
H  -4.597192 4.697626 -0.171198
H  -6.546009 3.345142 0.540198
elementType: F O N C H
totalener: -1560.10487874 hartree
nucrepener: 3505.31883709 hartree
electener: -5065.42371584 hartree
oneelecener: -9102.94633815 hartree
twoeener: 4037.52262231 hartree
cpcmener: -0.04056124 hartree
kineticenergy: 1553.63283796 hartree
xcener: -146.820092028837 hartree
chargesum: 0.0000000
charge: -0.215890 -0.212583 -0.281845 -0.439181 -0.311179 -0.328925 -0.099765 0.132734 0.061893 -0.040663 -0.292629 -0.314351 0.335707 -0.151888 -0.237785 0.431964 -0.199673 -0.179931 0.298038 0.068076 -0.332678 -0.190228 0.340914 -0.234128 -0.117021 -0.230767 0.441798 0.325882 -0.289535 -0.214167 -0.120299 -0.153552 -0.188843 0.100591 0.046164 0.093362 0.089637 0.093407 0.091219 0.097743 0.097969 0.139419 0.142414 0.140705 0.145676 0.131459 0.134326 0.147790 0.162900 0.150079 0.139486 0.153959 0.157619 0.161609 0.161972 0.160993
qa: -0.2159 -0.2126 -0.2818 -0.4392 -0.3112 -0.3289 -0.0998 0.1327 0.0619 -0.0407 -0.2926 -0.3144 0.3357 -0.1519 -0.2378 0.4320 -0.1997 -0.1799 0.2980 0.0681 -0.3327 -0.1902 0.3409 -0.2341 -0.1170 -0.2308 0.4418 0.3259 -0.2895 -0.2142 -0.1203 -0.1536 -0.1888 0.1006 0.0462 0.0934 0.0896 0.0934 0.0912 0.0977 0.0980 0.1394 0.1424 0.1407 0.1457 0.1315 0.1343 0.1478 0.1629 0.1501 0.1395 0.1540 0.1576 0.1616 0.1620 0.1610
va: 1.0711 1.0631 2.1473 2.0528 2.1030 2.0288 3.1097 3.6647 3.8099 3.4996 3.9236 3.9500 4.2641 3.9462 3.9869 3.7173 3.9519 3.9279 3.6385 3.5399 4.0989 3.9560 3.5804 4.0873 3.9105 3.9191 4.2101 3.6489 3.9682 3.9163 3.8927 3.8901 3.9074 1.0373 1.0260 1.0044 1.0018 1.0135 1.0017 1.0001 1.0044 1.0027 1.0186 1.0144 1.0046 1.0344 1.0287 1.0077 0.9883 1.0097 0.9753 1.0150 0.9980 0.9893 0.9894 0.9891
dispcorr: -0.037186256 hartree
energy: -1560.142065000387
dipole: 17.42336 -18.62911 -1.20575 -10.25846 9.30547 -0.95299 1.68599 -2.54882 -0.86282
magnitude: 1.76252 au
magnitude: 4.47998 debye
