program: Orca
programVersion: 5.0.2
elementType: F F O O O O N C C C C C C C C C C C C C C C C C C C C C C C C C C H H H H H H H H H H H H H H H H H H H H H H H
charge: 0
multiplicity: 1
keywords: wb97x-d3
keywords: def2-TZVPP
keywords: def2/J RIJCOSX
keywords: DEFGRID2
keywords: scfconv7
keywords: smallprint printgap noloewdin
keywords: NOSOSCF
formula: C26H23F2NO4
InChI: InChI=1/C26H23F2NO4/c1-17(2)24(18-11-13-21(14-12-18)32-26(27)28)25(30)33-23(16-29)19-7-6-10-22(15-19)31-20-8-4-3-5-9-20/h3-15,17,23-24,26H,1-2H3
56 atoms
F  -3.324887 -1.444531 2.384717
F  -3.450467 -3.318325 3.459801
O  3.056771 0.577619 -0.000815
O  1.925197 0.561061 -1.930845
O  -1.511362 -2.679178 2.760433
O  -2.21073 2.79065 -0.109065
N  4.255937 2.874365 2.047399
C  2.636223 -1.532949 -0.942722
C  2.598047 -2.262852 -2.289928
C  1.507052 -1.897156 0.004679
C  3.786185 -1.861442 -3.157203
C  2.602009 -3.770319 -2.066628
C  2.513348 -0.034395 -1.066379
C  1.775137 -2.333299 1.297759
C  0.178969 -1.72902 -0.370835
C  2.591626 1.896833 0.28739
C  0.749293 -2.602962 2.187374
C  -0.863345 -1.977619 0.510844
C  -0.568828 -2.417595 1.794543
C  1.187391 1.832928 0.836497
C  0.14609 2.387637 0.110637
C  0.934964 1.143345 2.019867
C  -1.156653 2.235409 0.569474
C  3.533631 2.42806 1.271932
C  -0.367348 1.01458 2.470415
C  -1.422435 1.548667 1.741502
C  -2.833888 -2.706342 2.43699
C  -2.363972 2.51552 -1.444637
C  -3.02316 3.472592 -2.204502
C  -1.931076 1.326537 -2.020066
C  -3.252363 3.234598 -3.551491
C  -2.161209 1.107642 -3.371402
C  -2.818796 2.055365 -4.143369
H  3.584084 -1.765897 -0.447432
H  1.674919 -1.995192 -2.812805
H  4.72856 -2.109619 -2.663555
H  3.801692 -0.795732 -3.386857
H  3.763172 -2.395151 -4.108035
H  3.500347 -4.085825 -1.530296
H  1.736751 -4.107981 -1.49556
H  2.587693 -4.295383 -3.022674
H  2.800635 -2.465055 1.619757
H  -0.067878 -1.383155 -1.367249
H  2.639164 2.543165 -0.594144
H  0.970737 -2.944308 3.190567
H  -1.874874 -1.799155 0.171752
H  0.347177 2.926414 -0.807639
H  1.746683 0.707338 2.589006
H  -0.569339 0.479245 3.388187
H  -2.442625 1.43859 2.085591
H  -3.065891 -3.221809 1.502287
H  -3.356298 4.393397 -1.742558
H  -1.426934 0.569519 -1.432407
H  -3.766948 3.981762 -4.141422
H  -1.823703 0.181451 -3.818126
H  -2.994051 1.876076 -5.195506
elementType: F O N C H
totalener: -1560.10613290 hartree
nucrepener: 3468.36980657 hartree
electener: -5028.47593947 hartree
oneelecener: -9027.57154165 hartree
twoeener: 3999.09560218 hartree
cpcmener: -0.04411498 hartree
kineticenergy: 1553.61157054 hartree
xcener: -146.815038248742 hartree
chargesum: 0.0000000
charge: -0.206166 -0.201818 -0.277373 -0.443367 -0.290200 -0.343572 -0.099421 0.132676 0.060442 -0.027128 -0.294816 -0.313925 0.335303 -0.152342 -0.235966 0.414058 -0.208831 -0.177977 0.291006 0.074339 -0.203669 -0.286517 0.292790 -0.224236 -0.088039 -0.242920 0.393745 0.262657 -0.225760 -0.135283 -0.142673 -0.198837 -0.168102 0.100220 0.045968 0.090399 0.093814 0.094006 0.091131 0.098129 0.098708 0.138870 0.154205 0.139744 0.144217 0.140181 0.150132 0.149533 0.158320 0.146773 0.130361 0.147988 0.137538 0.160697 0.160202 0.160783
qa: -0.2062 -0.2018 -0.2774 -0.4434 -0.2902 -0.3436 -0.0994 0.1327 0.0604 -0.0271 -0.2948 -0.3139 0.3353 -0.1523 -0.2360 0.4141 -0.2088 -0.1780 0.2910 0.0743 -0.2037 -0.2865 0.2928 -0.2242 -0.0880 -0.2429 0.3937 0.2627 -0.2258 -0.1353 -0.1427 -0.1988 -0.1681 0.1002 0.0460 0.0904 0.0938 0.0940 0.0911 0.0981 0.0987 0.1389 0.1542 0.1397 0.1442 0.1402 0.1501 0.1495 0.1583 0.1468 0.1304 0.1480 0.1375 0.1607 0.1602 0.1608
va: 1.0543 1.0759 2.1496 2.0444 2.0571 2.0657 3.1101 3.6664 3.8157 3.4694 3.9239 3.9474 4.2607 3.9461 3.9760 3.7306 3.9739 3.8593 3.7078 3.5104 3.9791 3.9709 3.6917 4.0842 3.8289 4.0067 4.2449 3.7051 3.9696 3.8262 3.9035 3.9371 3.8788 1.0379 1.0258 1.0019 1.0136 1.0041 1.0018 1.0006 1.0040 1.0029 1.0024 1.0165 1.0063 1.0137 1.0090 1.0088 0.9930 1.0112 0.9741 1.0077 0.9965 0.9881 0.9920 0.9891
dispcorr: -0.036366317 hartree
energy: -1560.142499212994
dipole: 17.54018 -17.86768 -0.32750 -8.60113 6.69358 -1.90755 -28.70958 26.99233 -1.71725
magnitude: 2.58746 au
magnitude: 6.57680 debye
