program: Orca
programVersion: 5.0.2
elementType: F F O O O O N C C C C C C C C C C C C C C C C C C C C C C C C C C H H H H H H H H H H H H H H H H H H H H H H H
charge: 0
multiplicity: 1
keywords: wb97x-d3
keywords: def2-TZVPP
keywords: def2/J RIJCOSX
keywords: DEFGRID2
keywords: scfconv7
keywords: smallprint printgap noloewdin
keywords: NOSOSCF
formula: C26H23F2NO4
InChI: InChI=1/C26H23F2NO4/c1-17(2)24(18-11-13-21(14-12-18)32-26(27)28)25(30)33-23(16-29)19-7-6-10-22(15-19)31-20-8-4-3-5-9-20/h3-15,17,23-24,26H,1-2H3
56 atoms
F  -4.393486 -1.042781 -1.821523
F  -3.177975 -2.389094 -2.991155
O  2.844999 0.519951 0.914172
O  3.820346 -0.267709 -0.937618
O  -2.675251 -1.95136 -0.867214
O  -2.111768 1.35936 -0.32214
N  2.603565 3.527822 2.284387
C  2.802165 -1.812326 0.623264
C  3.667307 -2.978467 0.128933
C  1.345936 -1.886522 0.19949
C  5.096843 -2.847627 0.64464
C  3.069482 -4.304173 0.583984
C  3.256571 -0.471391 0.105112
C  0.330689 -1.879208 1.149916
C  0.992467 -1.911466 -1.145314
C  2.739306 1.812338 0.320112
C  -1.001662 -1.89576 0.772811
C  -0.33694 -1.937904 -1.542158
C  -1.331195 -1.919173 -0.574306
C  1.509406 1.879184 -0.55276
C  0.265732 1.616263 0.013315
C  1.633488 2.131639 -1.910367
C  -0.861317 1.63743 -0.793497
C  2.657489 2.756073 1.43353
C  0.496886 2.130827 -2.707828
C  -0.749973 1.890765 -2.15622
C  -3.124126 -1.424949 -2.0402
C  -2.487186 1.727008 0.94444
C  -3.30602 0.845955 1.636155
C  -2.133331 2.951909 1.497345
C  -3.768048 1.192555 2.897826
C  -2.594835 3.279549 2.764208
C  -3.409744 2.404981 3.470778
H  2.836108 -1.792593 1.717091
H  3.685496 -2.966399 -0.965037
H  5.584668 -1.930703 0.312791
H  5.706386 -3.681648 0.294653
H  5.118777 -2.860343 1.736686
H  2.993909 -4.347646 1.673074
H  2.07379 -4.473745 0.173606
H  3.700048 -5.134641 0.264113
H  0.580509 -1.852852 2.203097
H  1.756257 -1.919616 -1.913022
H  3.635424 2.069011 -0.253135
H  -1.782459 -1.885808 1.52237
H  -0.566211 -1.984449 -2.598526
H  0.182001 1.399575 1.071915
H  2.606401 2.327247 -2.34187
H  0.581882 2.3251 -3.768369
H  -1.637358 1.89905 -2.776216
H  -2.535851 -0.585858 -2.417334
H  -3.5881 -0.096982 1.185666
H  -1.509461 3.649578 0.9533
H  -4.408078 0.504764 3.434519
H  -2.317127 4.23187 3.196406
H  -3.766229 2.668787 4.457337
elementType: F O N C H
totalener: -1560.10770325 hartree
nucrepener: 3515.48407910 hartree
electener: -5075.59178236 hartree
oneelecener: -9121.95689003 hartree
twoeener: 4046.36510768 hartree
cpcmener: -0.04177214 hartree
kineticenergy: 1553.61883727 hartree
xcener: -146.816789183302 hartree
chargesum: 0.0000000
charge: -0.206409 -0.213210 -0.287014 -0.439002 -0.288981 -0.329012 -0.099461 0.137810 0.059834 -0.036245 -0.294314 -0.314422 0.333995 -0.152830 -0.203384 0.434013 -0.220734 -0.180452 0.276381 0.049895 -0.255102 -0.199136 0.286566 -0.234633 -0.097699 -0.264524 0.415815 0.340258 -0.294953 -0.215300 -0.114675 -0.141879 -0.197384 0.099738 0.046578 0.094983 0.094232 0.089570 0.090679 0.097828 0.099218 0.139717 0.143021 0.143183 0.150749 0.143926 0.148434 0.150173 0.162047 0.151323 0.110944 0.148208 0.156067 0.162346 0.162324 0.160899
qa: -0.2064 -0.2132 -0.2870 -0.4390 -0.2890 -0.3290 -0.0995 0.1378 0.0598 -0.0362 -0.2943 -0.3144 0.3340 -0.1528 -0.2034 0.4340 -0.2207 -0.1805 0.2764 0.0499 -0.2551 -0.1991 0.2866 -0.2346 -0.0977 -0.2645 0.4158 0.3403 -0.2950 -0.2153 -0.1147 -0.1419 -0.1974 0.0997 0.0466 0.0950 0.0942 0.0896 0.0907 0.0978 0.0992 0.1397 0.1430 0.1432 0.1507 0.1439 0.1484 0.1502 0.1620 0.1513 0.1109 0.1482 0.1561 0.1623 0.1623 0.1609
va: 1.0656 1.0557 2.1481 2.0536 2.0306 2.0303 3.1099 3.6601 3.8109 3.5024 3.9241 3.9505 4.2749 3.9409 3.9475 3.7275 3.9510 3.8948 3.7060 3.5892 3.9669 3.9539 3.5991 4.0917 3.8840 4.0080 4.2386 3.6423 3.9743 3.9309 3.8961 3.8863 3.9180 1.0379 1.0262 1.0130 1.0042 1.0020 1.0019 1.0004 1.0043 1.0038 1.0179 1.0159 1.0011 1.0132 1.0138 1.0043 0.9872 1.0016 0.9823 1.0195 0.9986 0.9891 0.9889 0.9895
dispcorr: -0.037524263 hartree
energy: -1560.145227517166
dipole: 24.86490 -24.14346 0.72144 -10.35629 9.87555 -0.48075 11.27901 -11.72321 -0.44420
magnitude: 0.97412 au
magnitude: 2.47601 debye
