program: Orca
programVersion: 5.0.2
elementType: F F O O O O N C C C C C C C C C C C C C C C C C C C C C C C C C C H H H H H H H H H H H H H H H H H H H H H H H
charge: 0
multiplicity: 1
keywords: wb97x-d3
keywords: def2-TZVPP
keywords: def2/J RIJCOSX
keywords: DEFGRID2
keywords: scfconv7
keywords: smallprint printgap noloewdin
keywords: NOSOSCF
formula: C26H23F2NO4
InChI: InChI=1/C26H23F2NO4/c1-17(2)24(18-11-13-21(14-12-18)32-26(27)28)25(30)33-23(16-29)19-7-6-10-22(15-19)31-20-8-4-3-5-9-20/h3-15,17,23-24,26H,1-2H3
56 atoms
F  -3.242019 -2.45924 3.050299
F  -4.343914 -1.041377 1.853234
O  2.735336 0.432387 -0.97171
O  3.708915 0.07923 1.003428
O  -2.63035 -2.025149 0.955923
O  -2.241046 1.240366 0.339598
N  4.66498 3.107342 -0.019126
C  2.912122 -1.81744 -0.264565
C  3.389138 -2.298764 -1.642435
C  1.428191 -1.954716 0.030676
C  4.876927 -2.008558 -1.813973
C  3.124871 -3.791124 -1.796342
C  3.199355 -0.359836 0.00611
C  0.447524 -1.872414 -0.95452
C  1.020777 -2.065574 1.35535
C  2.493811 1.801037 -0.658866
C  -0.897334 -1.90006 -0.62457
C  -0.321214 -2.095835 1.705401
C  -1.277103 -1.999757 0.705817
C  1.359913 1.925002 0.332214
C  0.099055 1.567386 -0.133121
C  1.538594 2.305236 1.655175
C  -0.984991 1.606507 0.729609
C  3.717935 2.50048 -0.260114
C  0.445539 2.324747 2.510504
C  -0.816295 1.977508 2.057337
C  -3.102869 -1.488252 2.114119
C  -2.704065 1.549734 -0.913574
C  -2.415216 2.757934 -1.537151
C  -3.540807 0.621847 -1.518668
C  -2.960937 3.021206 -2.785685
C  -4.087223 0.904716 -2.762101
C  -3.795457 2.10004 -3.404857
H  3.463157 -2.379018 0.495226
H  2.844763 -1.766483 -2.427332
H  5.464847 -2.501694 -1.036509
H  5.105772 -0.941613 -1.778139
H  5.229123 -2.376615 -2.778107
H  3.469246 -4.139737 -2.770636
H  3.658083 -4.361594 -1.032691
H  2.066235 -4.039264 -1.717947
H  0.718894 -1.77649 -1.997717
H  1.764309 -2.134681 2.140012
H  2.192878 2.244071 -1.61074
H  -1.650332 -1.83015 -1.398994
H  -0.591196 -2.208158 2.747219
H  -0.029451 1.267683 -1.166259
H  2.513632 2.588035 2.029372
H  0.578125 2.616905 3.543413
H  -1.668159 2.001096 2.724906
H  -2.490499 -0.68254 2.523816
H  -1.775951 3.491657 -1.06284
H  -3.77037 -0.309321 -1.017405
H  -2.733231 3.96054 -3.272392
H  -4.740691 0.18008 -3.230075
H  -4.218188 2.314945 -4.377099
elementType: F O N C H
totalener: -1560.10456906 hartree
nucrepener: 3514.70545729 hartree
electener: -5074.81002635 hartree
oneelecener: -9120.12744124 hartree
twoeener: 4045.31741490 hartree
cpcmener: -0.04575933 hartree
kineticenergy: 1553.61949118 hartree
xcener: -146.819835930588 hartree
chargesum: 0.0000000
charge: -0.213719 -0.205968 -0.273880 -0.432606 -0.288970 -0.329432 -0.093924 0.172538 0.052275 0.020317 -0.301450 -0.297767 0.313929 -0.207531 -0.225454 0.425645 -0.207179 -0.160656 0.246529 0.028169 -0.285724 -0.177296 0.303985 -0.235190 -0.123214 -0.250236 0.409544 0.348225 -0.216167 -0.297984 -0.144930 -0.117360 -0.197899 0.102881 0.049547 0.095147 0.092618 0.095177 0.096490 0.091670 0.099699 0.148752 0.141967 0.144766 0.156348 0.146734 0.147370 0.138573 0.161802 0.150706 0.115069 0.156213 0.145881 0.162029 0.162877 0.161065
qa: -0.2137 -0.2060 -0.2739 -0.4326 -0.2890 -0.3294 -0.0939 0.1725 0.0523 0.0203 -0.3015 -0.2978 0.3139 -0.2075 -0.2255 0.4256 -0.2072 -0.1607 0.2465 0.0282 -0.2857 -0.1773 0.3040 -0.2352 -0.1232 -0.2502 0.4095 0.3482 -0.2162 -0.2980 -0.1449 -0.1174 -0.1979 0.1029 0.0495 0.0951 0.0926 0.0952 0.0965 0.0917 0.0997 0.1488 0.1420 0.1448 0.1563 0.1467 0.1474 0.1386 0.1618 0.1507 0.1151 0.1562 0.1459 0.1620 0.1629 0.1611
va: 1.0547 1.0645 2.1254 2.0682 2.0272 2.0267 3.1071 3.6493 3.8347 3.5562 3.9359 3.9340 4.1975 3.9361 4.0227 3.9034 3.9413 3.8685 3.7600 3.6574 3.9771 3.9323 3.5642 4.0502 3.9420 4.0122 4.2369 3.6318 3.9317 3.9639 3.8893 3.9039 3.9172 1.0250 1.0250 1.0031 1.0111 1.0032 1.0048 1.0019 1.0026 1.0031 1.0124 0.9955 0.9979 1.0114 1.0107 1.0170 0.9881 1.0022 0.9811 0.9972 1.0255 0.9891 0.9888 0.9893
dispcorr: -0.037424991 hartree
energy: -1560.141994049039
dipole: 21.53735 -22.37754 -0.84018 -6.92716 6.53980 -0.38736 -20.10859 18.51233 -1.59626
magnitude: 1.84499 au
magnitude: 4.68960 debye
