program: Gaussian 09
title: 000002063
version: EM64L-G09RevD.01
frameworkgroup: C1[X(C11H8N2O)]
method: RPBEPBE
basis: SDD
operation: Freq
keyword: #p
keyword: freq=noraman
keyword: PBEPBE/SDD
title: #p freq=noraman PBEPBE/SDD
converged: YES YES NO NO
title: Mulliken charges:
elementType: O N N C C C C C C C C C C C H H H H H H H H
charge: -0.247806 -0.000016 -0.018078 0.488320 0.328434 -0.379331 -0.318271 -0.361783 -0.364235 -0.350881 0.278922 -0.536387 -0.245509 -0.251047 0.238030 0.256199 0.262478 0.252758 0.250880 0.231283 0.231523 0.254516
chargesum: 0.00000
title: Mulliken charges with hydrogens summed into heavy atoms:
elementType: O N N C C C C C C C C C C C
charge: -0.247806 -0.000016 -0.018078 0.488320 0.328434 -0.141301 -0.062072 -0.099305 -0.111476 -0.100000 0.278922 0.180934 -0.245509 -0.251047
polarizability: 2.86559427e+02 1.04173141e+00 1.36132571e+02 1.44437831e-02 -4.81984299e-02 5.67200393e+01
1716.lowfreq: -2.6627 -1.1690 -0.0009 -0.0007 -0.0007 5.1135 43.3694 54.4101 91.9277
frequency: 43.3658 54.3972 91.9276 111.8042 132.6780 171.6514 175.2755 216.5301 264.0217 273.3526 312.8279 370.9978 416.4988 434.1273 459.3331 475.5385 534.7797 557.2899 597.1199 625.3451 649.1089 740.3737 748.2145 778.9988 817.8383 838.9118 853.7127 943.7923 968.3828 975.8601 977.0198 997.1261 1111.1350 1119.6040 1153.7086 1159.5245 1188.7512 1242.2194 1259.8305 1316.7512 1352.3947 1393.9818 1437.5385 1443.0597 1468.3396 1469.8738 1500.2015 1558.9471 1580.7030 1621.4377 2159.2385 2172.1564 2975.5324 3070.4231 3113.9265 3131.6188 3138.7816 3161.6388 3175.6770 3187.1488
redmass: 5.3355 4.9467 7.3813 3.8877 12.1601 3.5988 5.9124 1.3267 4.1613 4.7275 7.1400 4.2927 3.1152 9.2174 6.6742 4.3295 2.5576 6.7504 12.0810 7.2433 6.7361 3.6134 5.6537 7.1633 1.2637 1.6008 5.6118 1.3757 1.3989 1.4221 8.8579 2.6535 1.2583 1.5672 2.0982 1.6272 1.3296 2.2011 3.3952 1.4255 2.6524 2.1351 1.2650 3.3583 1.0886 1.0494 2.4405 6.5335 5.8507 6.1629 12.6179 12.6338 1.0323 1.1048 1.0893 1.0901 1.1005 1.0888 1.0953 1.0952
irintensity: 1.1524 1.5699 2.2641 10.2077 4.9957 0.0053 0.3096 0.5416 5.3794 4.0181 0.6468 1.4707 0.5933 6.4744 1.4524 6.4241 23.1790 34.3992 0.3439 0.7430 2.7429 1.7542 1.9337 0.1718 1.1884 68.0114 2.4115 19.3202 1.9502 4.2482 60.2759 4.2074 0.1337 5.6134 3.7033 11.4701 223.9062 6.2738 270.2655 0.4776 3.6324 113.2029 7.9773 5.3759 77.0528 16.6175 109.0118 1.2690 313.6018 225.2941 14.3187 87.2355 63.6252 36.7153 5.1585 8.0636 19.7057 5.3762 4.9213 4.7771
temp: 298.150 k
press: 1.00000 atm
elementType: 8 7 7 6 6 6 6 6 6 6 6 6 6 6 1 1 1 1 1 1 1 1
symmnumber: 1
zpe: 420322.0 jmol-1
zpe.correction: 0.160092 hartree
zpe.thermalcorrener: 0.172926 hartree
zpe.thermalcorrenthalpy: 0.173871 hartree
zpe.thermalcorrgfe: 0.119979 hartree
zpe.sumelectzpe: -607.668863 hartree
zpe.sumelectthermal: -607.656029 hartree
zpe.sumelectthermalent: -607.655085 hartree
zpe.sumelectthermalfe: -607.708976 hartree
dipole: -8.0726 -0.9508 -0.0054
dipole: 8.1284
quadrupole: -97.1363 -81.5816 -83.2917
quadrupole: -10.3759 -0.0517 -0.0416
quadrupole: -9.7998 5.7549 4.0448 -10.3759 -0.0517 -0.0416
hfenergy: -607.8289556 hartree
pointgroup: C01 [X(C11H8N2O1)]
dipole: 3.1631661 0.2565424 0.3942978 debye
dipolederiv: -2.2788999 0.2272178 0.2063563 0.233264 -0.3331262 -0.0440766 0.2176001 -0.0441366 -0.3349636 -0.559651 0.020869 0.0141711 0.1015079 -0.225208 0.0141358 0.1100995 0.0115494 -0.2175327 -0.1938934 0.0048054 0.0070208 -0.174967 -0.2771955 -0.0520034 -0.2035316 -0.0469137 -0.2976499 -1.1401573 0.0029429 -0.0301221 0.1711809 -0.0599327 -0.0525367 0.1656813 -0.0575147 -0.0749762 2.0570689 -0.1498897 -0.117115 0.0521205 0.147595 0.02293 0.1199993 0.0166417 0.1544594 0.5953706 -0.0143197 0.0054748 0.1905247 -0.0146438 0.1469864 0.2466523 0.1406642 0.0400275 0.5280979 -0.0305288 -0.0171167 -0.2525475 -0.0299506 0.0523893 -0.2776863 0.0585317 -0.0180213 -0.6184726 0.0782294 0.0789453 0.3924139 -0.1100218 0.0802395 0.4494735 0.0710595 -0.0696838 -0.7961112 -0.0322772 -0.0565292 -0.3544695 -0.124877 0.0711652 -0.4388289 0.0810022 -0.1108381 1.6476343 0.159475 0.2374689 0.1652574 0.0183956 0.0864608 0.2457359 0.0870305 0.0581052 -0.7488268 -0.0563253 -0.0912098 -0.44368 0.0784309 -0.0486982 -0.547412 -0.0374073 0.0484813 0.7201963 -0.110547 -0.117191 -0.465245 0.3680384 0.0522719 -0.5362722 0.0632642 0.3689463 0.6786482 -0.0779064 -0.0720422 -0.1701069 -0.0193868 -0.072899 -0.1817259 -0.0700487 -0.0494003 -0.1455731 -0.0162288 -0.0253076 0.2855552 0.1653675 0.1370544 0.3286422 0.1284268 0.2154921 0.0488434 0.0695876 0.0790449 0.0337339 0.0713088 -0.09307 0.0370198 -0.0918585 0.0429907 0.0913913 -0.02346 -0.0303244 -0.0164096 0.0907065 -0.0640544 -0.0223258 -0.0642045 0.0669972 0.0319643 -0.046389 -0.0594665 -0.0449758 0.1082007 -0.0789876 -0.0578033 -0.0790368 0.0779716 0.0249411 0.0427292 0.0465246 0.0619973 0.0862242 -0.0927435 0.0687813 -0.0935897 0.056818 0.0760676 0.0011754 -0.0005641 0.0551418 0.0609393 -0.0850458 0.0652537 -0.086854 0.0344119 0.0685033 0.0378775 -0.075277 0.1064241 0.0319937 0.0434655 0.1227459 0.0262164 -0.1363136 0.0647956 -0.0871543 0.0260394 0.0979711 -0.1431141 -0.0003533 0.1261884 0.009075 0.0427035 -0.1519377 0.0001171 -0.0087805 -0.0246914 0.1102557 -0.0226304 -0.0382873 -0.0218969 0.1019747 unknown
polarizability: 286.284121|0.1168248|89.929852|7.018402|39.2005138|103.1980644 unknown
InChI: InChI=1S/C11H8N2O/c1-14-11-4-2-9(3-5-11)6-10(7-12)8-13/h2-6H,1H3
charge 0 multiplicity 1
22 atoms
O  4.172016 0.29195 0.199654
N  -5.037671 0.66412 0.362757
N  -2.312558 -1.656082 -2.285617
C  -0.064364 0.465584 0.272589
C  2.782571 0.300393 0.166688
C  0.761691 1.208869 1.179834
C  0.589547 -0.362803 -0.690867
C  2.156542 1.132746 1.134209
C  1.990026 -0.447784 -0.747155
C  -1.502455 0.620601 0.412046
C  -2.558349 0.047646 -0.291295
C  4.888697 -0.55221 -0.768855
C  -3.912872 0.383698 0.064049
C  -2.413434 -0.881573 -1.377812
H  0.285955 1.853485 1.92859
H  0.004871 -0.947285 -1.405148
H  2.786411 1.698897 1.82593
H  2.454827 -1.092153 -1.49864
H  -1.8136 1.307934 1.211409
H  4.669419 -0.239199 -1.806701
H  4.631353 -1.619126 -0.632132
H  5.953477 -0.393607 -0.548035
