program: Orca
programVersion: 5.0.2
elementType: F F O O O O N C C C C C C C C C C C C C C C C C C C C C C C C C C H H H H H H H H H H H H H H H H H H H H H H H
charge: 0
multiplicity: 1
keywords: wb97x-d3
keywords: def2-TZVPP
keywords: def2/J RIJCOSX
keywords: DEFGRID2
keywords: scfconv7
keywords: smallprint printgap noloewdin
keywords: NOSOSCF
formula: C26H23F2NO4
InChI: InChI=1/C26H23F2NO4/c1-17(2)24(18-11-13-21(14-12-18)32-26(27)28)25(30)33-23(16-29)19-7-6-10-22(15-19)31-20-8-4-3-5-9-20/h3-15,17,23-24,26H,1-2H3
56 atoms
F  -3.592171 -1.160197 0.906184
F  -4.052234 -2.848784 2.177551
O  3.474955 0.325024 0.366738
O  2.953303 0.100568 -1.796977
O  -1.986409 -2.246723 2.00446
O  -1.302457 3.000757 -1.285497
N  4.308493 2.861109 2.316008
C  3.141832 -1.870374 -0.402921
C  3.439995 -2.776853 -1.602663
C  1.754961 -2.036847 0.193673
C  4.872548 -2.572804 -2.085078
C  3.22114 -4.235994 -1.221716
C  3.207575 -0.399975 -0.733144
C  1.597783 -2.361073 1.537354
C  0.613783 -1.795329 -0.563438
C  3.057273 1.688186 0.346077
C  0.340327 -2.446028 2.11019
C  -0.654594 -1.860066 -0.003391
C  -0.783972 -2.186313 1.339617
C  1.561997 1.771675 0.538313
C  0.775086 2.330184 -0.455143
C  0.980243 1.227631 1.679197
C  -0.604908 2.373569 -0.292845
C  3.767454 2.330409 1.450889
C  -0.395906 1.270433 1.821808
C  -1.198189 1.846643 0.84612
C  -3.147533 -2.37751 1.305669
C  -2.615105 2.68306 -1.537597
C  -3.059208 1.368515 -1.60525
C  -3.476339 3.740278 -1.790624
C  -4.387785 1.121825 -1.920345
C  -4.798324 3.477474 -2.120639
C  -5.260989 2.170316 -2.180486
H  3.874121 -2.083224 0.381969
H  2.753691 -2.526372 -2.417259
H  5.08561 -3.220089 -2.936777
H  5.586241 -2.821749 -1.296438
H  5.071259 -1.548385 -2.401555
H  3.859217 -4.523167 -0.382638
H  2.188099 -4.439885 -0.938931
H  3.465738 -4.889096 -2.060316
H  2.470453 -2.550175 2.149843
H  0.695706 -1.532189 -1.610728
H  3.361557 2.192625 -0.575829
H  0.232102 -2.701282 3.156489
H  -1.507888 -1.632666 -0.628312
H  1.2267 2.742158 -1.349328
H  1.590163 0.777564 2.452608
H  -0.858161 0.855531 2.707285
H  -2.26993 1.884266 0.989152
H  -3.083744 -3.037677 0.438147
H  -2.382235 0.543164 -1.422281
H  -3.112337 4.758461 -1.736276
H  -4.736958 0.098922 -1.97069
H  -5.468374 4.302299 -2.324342
H  -6.293691 1.969101 -2.431721
elementType: F O N C H
totalener: -1560.10661993 hartree
nucrepener: 3429.82583962 hartree
electener: -4989.93245955 hartree
oneelecener: -8950.63913048 hartree
twoeener: 3960.70667093 hartree
cpcmener: -0.04398501 hartree
kineticenergy: 1553.61045371 hartree
xcener: -146.814531893685 hartree
chargesum: -0.0000000
charge: -0.205482 -0.201845 -0.280708 -0.440202 -0.291722 -0.333417 -0.099405 0.136425 0.064363 -0.044845 -0.293428 -0.314543 0.335142 -0.149596 -0.214725 0.416800 -0.207222 -0.187724 0.282460 0.058500 -0.248435 -0.280639 0.332389 -0.226999 -0.111316 -0.223683 0.390600 0.290944 -0.201042 -0.240997 -0.166359 -0.131929 -0.175117 0.098451 0.046353 0.093786 0.089529 0.094205 0.090874 0.097871 0.098670 0.139928 0.142355 0.140011 0.144862 0.152083 0.136709 0.152050 0.159205 0.154031 0.131440 0.172336 0.147805 0.158809 0.161597 0.160797
qa: -0.2055 -0.2018 -0.2807 -0.4402 -0.2917 -0.3334 -0.0994 0.1364 0.0644 -0.0448 -0.2934 -0.3145 0.3351 -0.1496 -0.2147 0.4168 -0.2072 -0.1877 0.2825 0.0585 -0.2484 -0.2806 0.3324 -0.2270 -0.1113 -0.2237 0.3906 0.2909 -0.2010 -0.2410 -0.1664 -0.1319 -0.1751 0.0985 0.0464 0.0938 0.0895 0.0942 0.0909 0.0979 0.0987 0.1399 0.1424 0.1400 0.1449 0.1521 0.1367 0.1520 0.1592 0.1540 0.1314 0.1723 0.1478 0.1588 0.1616 0.1608
va: 1.0502 1.0749 2.1468 2.0519 2.0454 2.0796 3.1104 3.6655 3.8042 3.5110 3.9251 3.9508 4.2643 3.9359 3.9713 3.7227 3.9898 3.8627 3.7003 3.5658 4.0735 3.9773 3.6998 4.0905 3.8573 3.9071 4.2406 3.6827 3.8935 3.9991 3.9053 3.8813 3.8967 1.0390 1.0262 1.0043 1.0019 1.0130 1.0016 1.0002 1.0043 1.0025 1.0202 1.0178 1.0059 1.0055 1.0224 1.0085 0.9933 1.0011 0.9754 0.9823 1.0076 0.9943 0.9880 0.9892
dispcorr: -0.035291406 hartree
energy: -1560.141911333043
dipole: 18.14772 -18.96157 -0.81385 -12.34326 10.24223 -2.10103 -16.23308 15.13508 -1.09800
magnitude: 2.50645 au
magnitude: 6.37089 debye
