program: Orca
programVersion: 5.0.2
elementType: F F O O O O N C C C C C C C C C C C C C C C C C C C C C C C C C C H H H H H H H H H H H H H H H H H H H H H H H
charge: 0
multiplicity: 1
keywords: wb97x-d3
keywords: def2-TZVPP
keywords: def2/J RIJCOSX
keywords: DEFGRID2
keywords: scfconv7
keywords: smallprint printgap noloewdin
keywords: NOSOSCF
formula: C26H23F2NO4
InChI: InChI=1/C26H23F2NO4/c1-17(2)24(18-11-13-21(14-12-18)32-26(27)28)25(30)33-23(16-29)19-7-6-10-22(15-19)31-20-8-4-3-5-9-20/h3-15,17,23-24,26H,1-2H3
56 atoms
F  -3.476904 -2.948286 0.457739
F  -3.32701 -0.904341 1.158246
O  3.44824 0.349596 0.358969
O  2.837752 0.1926 -1.786496
O  -1.986407 -2.458817 2.059579
O  -1.375023 3.084482 -1.064103
N  4.345779 2.828288 2.361049
C  3.068935 -1.820633 -0.462618
C  3.330538 -2.687994 -1.700376
C  1.700063 -2.014819 0.164689
C  4.74715 -2.466959 -2.219832
C  3.121834 -4.159117 -1.361952
C  3.127273 -0.341163 -0.747883
C  1.57873 -2.410694 1.491646
C  0.536491 -1.756455 -0.55153
C  3.037601 1.71497 0.393834
C  0.334604 -2.548992 2.082816
C  -0.720265 -1.888915 0.022713
C  -0.814855 -2.285664 1.350524
C  1.54854 1.79453 0.62804
C  0.735082 2.391919 -0.32118
C  0.997488 1.20286 1.760181
C  -0.639209 2.425985 -0.118815
C  3.777422 2.319311 1.50074
C  -0.374252 1.238377 1.943099
C  -1.201248 1.854826 1.014362
C  -3.216312 -2.195325 1.551942
C  -2.659612 2.685972 -1.346423
C  -3.595959 3.687389 -1.55508
C  -3.005354 1.346969 -1.480669
C  -4.893806 3.343319 -1.905487
C  -4.311313 1.017781 -1.813477
C  -5.259198 2.010031 -2.028093
H  3.822589 -2.060042 0.293815
H  2.619208 -2.410468 -2.484091
H  4.934421 -1.43308 -2.511423
H  4.934278 -3.088075 -3.096628
H  5.484621 -2.738045 -1.461098
H  3.782196 -4.473649 -0.550603
H  2.096676 -4.372854 -1.058787
H  3.343405 -4.783616 -2.228307
H  2.466521 -2.61434 2.077115
H  0.589063 -1.440734 -1.585993
H  3.320677 2.248709 -0.518378
H  0.254889 -2.859016 3.116829
H  -1.582268 -1.674049 -0.590797
H  1.162156 2.838688 -1.210572
H  1.627945 0.721729 2.49742
H  -0.811063 0.788148 2.824057
H  -2.268769 1.88999 1.186314
H  -3.955072 -2.405872 2.322587
H  -3.309075 4.725886 -1.450113
H  -2.269625 0.565626 -1.336024
H  -5.622948 4.124988 -2.072683
H  -4.583996 -0.024612 -1.91314
H  -6.274505 1.745701 -2.291194
elementType: F O N C H
totalener: -1560.10497843 hartree
nucrepener: 3457.69372340 hartree
electener: -5017.79870183 hartree
oneelecener: -9007.06425458 hartree
twoeener: 3989.26555275 hartree
cpcmener: -0.04126816 hartree
kineticenergy: 1553.61519379 hartree
xcener: -146.815199987705 hartree
chargesum: -0.0000000
charge: -0.217866 -0.211760 -0.281162 -0.440682 -0.311977 -0.337230 -0.098756 0.139417 0.063244 -0.033292 -0.292814 -0.314755 0.334615 -0.164236 -0.223612 0.420738 -0.188308 -0.198394 0.288360 0.055582 -0.242871 -0.271758 0.317807 -0.228228 -0.123260 -0.210086 0.434318 0.290881 -0.241551 -0.195267 -0.132351 -0.171121 -0.174536 0.097774 0.046052 0.094168 0.093546 0.089637 0.091136 0.097598 0.098543 0.139472 0.141221 0.140085 0.143237 0.142485 0.137348 0.152243 0.159994 0.154566 0.142814 0.148022 0.170850 0.161195 0.158203 0.160724
qa: -0.2179 -0.2118 -0.2812 -0.4407 -0.3120 -0.3372 -0.0988 0.1394 0.0632 -0.0333 -0.2928 -0.3148 0.3346 -0.1642 -0.2236 0.4207 -0.1883 -0.1984 0.2884 0.0556 -0.2429 -0.2718 0.3178 -0.2282 -0.1233 -0.2101 0.4343 0.2909 -0.2416 -0.1953 -0.1324 -0.1711 -0.1745 0.0978 0.0461 0.0942 0.0935 0.0896 0.0911 0.0976 0.0985 0.1395 0.1412 0.1401 0.1432 0.1425 0.1373 0.1522 0.1600 0.1546 0.1428 0.1480 0.1709 0.1612 0.1582 0.1607
va: 1.0635 1.0743 2.1476 2.0515 2.1190 2.0751 3.1106 3.6649 3.8052 3.4966 3.9247 3.9518 4.2673 3.9421 3.9665 3.7211 3.9746 3.9118 3.6636 3.5621 4.0782 3.9713 3.7099 4.0911 3.8554 3.8962 4.2160 3.6810 3.9967 3.8771 3.8825 3.9089 3.8938 1.0395 1.0263 1.0129 1.0044 1.0020 1.0016 1.0002 1.0045 1.0028 1.0212 1.0175 1.0066 1.0199 1.0216 1.0086 0.9922 1.0030 0.9721 1.0073 0.9831 0.9880 0.9949 0.9890
dispcorr: -0.035832925 hartree
energy: -1560.140811356563
dipole: 15.54421 -16.96133 -1.41712 -11.99423 10.18613 -1.80810 -12.79553 12.87493 0.07940
magnitude: 2.29865 au
magnitude: 5.84269 debye
