program: Orca
programVersion: 5.0.2
elementType: F F O O O O N C C C C C C C C C C C C C C C C C C C C C C C C C C H H H H H H H H H H H H H H H H H H H H H H H
charge: 0
multiplicity: 1
keywords: wb97x-d3
keywords: def2-TZVPP
keywords: def2/J RIJCOSX
keywords: DEFGRID2
keywords: scfconv7
keywords: smallprint printgap noloewdin
keywords: NOSOSCF
formula: C26H23F2NO4
InChI: InChI=1/C26H23F2NO4/c1-17(2)24(18-11-13-21(14-12-18)32-26(27)28)25(30)33-23(16-29)19-7-6-10-22(15-19)31-20-8-4-3-5-9-20/h3-15,17,23-24,26H,1-2H3
56 atoms
F  -3.519148 -3.63455 -0.36063
F  -2.691171 -3.694583 -2.347331
O  2.713726 0.466485 1.130805
O  3.689453 -0.183401 -0.771942
O  -2.84182 -1.719798 -1.305551
O  -1.875337 1.855567 -0.704243
N  2.49288 3.244182 2.896262
C  2.512483 -1.806487 0.588286
C  3.335072 -2.976651 0.032771
C  1.082381 -1.76869 0.08401
C  4.731677 -2.988435 0.644916
C  2.627377 -4.296391 0.316743
C  3.076153 -0.456037 0.226322
C  0.019453 -1.78534 0.9787
C  0.811758 -1.691074 -1.279978
C  2.816043 1.827223 0.726117
C  -1.292831 -1.771453 0.528136
C  -0.492863 -1.678417 -1.743793
C  -1.535864 -1.732999 -0.833915
C  1.746836 2.174229 -0.282816
C  0.425284 1.850416 0.000814
C  2.086225 2.788568 -1.478968
C  -0.560639 2.171006 -0.919532
C  2.632232 2.604796 1.950663
C  1.088328 3.09128 -2.394385
C  -0.236354 2.790874 -2.118654
C  -3.43045 -2.92825 -1.512407
C  -2.436669 2.091085 0.526069
C  -2.0811 3.181634 1.310876
C  -3.428878 1.214208 0.941493
C  -2.71775 3.375515 2.528354
C  -4.063816 1.428208 2.156283
C  -3.706815 2.502196 2.959473
H  2.484764 -1.888924 1.678975
H  3.425857 -2.861737 -1.051436
H  5.29101 -2.075158 0.439346
H  5.315604 -3.820199 0.248969
H  4.678578 -3.109423 1.72903
H  3.225615 -5.133136 -0.046411
H  2.475938 -4.439039 1.389426
H  1.652935 -4.35764 -0.168356
H  0.213193 -1.824795 2.04317
H  1.619875 -1.654482 -1.999722
H  3.810606 2.058606 0.332599
H  -2.111317 -1.784297 1.235575
H  -0.694183 -1.620344 -2.805272
H  0.165898 1.361691 0.932994
H  3.11954 3.028618 -1.69333
H  1.342295 3.571429 -3.329639
H  -1.015866 3.035202 -2.828513
H  -4.423029 -2.770471 -1.928033
H  -1.320029 3.879519 0.986154
H  -3.706405 0.375445 0.316927
H  -2.436583 4.222332 3.140281
H  -4.836897 0.742419 2.476692
H  -4.197774 2.660259 3.910149
elementType: F O N C H
totalener: -1560.10626833 hartree
nucrepener: 3475.06249659 hartree
electener: -5035.16876493 hartree
oneelecener: -9042.46956816 hartree
twoeener: 4007.30080323 hartree
cpcmener: -0.04224264 hartree
kineticenergy: 1553.65461294 hartree
xcener: -146.818759316210 hartree
chargesum: 0.0000000
charge: -0.214519 -0.213302 -0.283681 -0.439831 -0.349767 -0.343699 -0.098963 0.145474 0.059179 -0.016963 -0.295316 -0.312077 0.329501 -0.186380 -0.163965 0.432741 -0.173632 -0.216770 0.265268 0.064222 -0.239930 -0.192879 0.240083 -0.230763 -0.115809 -0.236609 0.421652 0.306934 -0.186051 -0.282067 -0.157617 -0.125588 -0.186690 0.099326 0.047369 0.094788 0.094638 0.090368 0.098956 0.090976 0.097378 0.140836 0.142699 0.146249 0.152599 0.151157 0.155591 0.150307 0.163097 0.150997 0.135448 0.154165 0.158193 0.162124 0.159773 0.160781
qa: -0.2145 -0.2133 -0.2837 -0.4398 -0.3498 -0.3437 -0.0990 0.1455 0.0592 -0.0170 -0.2953 -0.3121 0.3295 -0.1864 -0.1640 0.4327 -0.1736 -0.2168 0.2653 0.0642 -0.2399 -0.1929 0.2401 -0.2308 -0.1158 -0.2366 0.4217 0.3069 -0.1861 -0.2821 -0.1576 -0.1256 -0.1867 0.0993 0.0474 0.0948 0.0946 0.0904 0.0990 0.0910 0.0974 0.1408 0.1427 0.1462 0.1526 0.1512 0.1556 0.1503 0.1631 0.1510 0.1354 0.1542 0.1582 0.1621 0.1598 0.1608
va: 1.0621 1.0654 2.1476 2.0536 2.0061 2.0266 3.1085 3.6598 3.8142 3.4617 3.9270 3.9486 4.2613 3.9231 3.9056 3.7174 3.9683 4.0813 3.5674 3.5505 3.9441 3.9594 3.6464 4.0946 3.8941 4.0485 4.2372 3.6727 3.8904 3.9383 3.8947 3.8969 3.9047 1.0379 1.0265 1.0126 1.0040 1.0019 1.0044 1.0022 1.0007 1.0045 1.0156 1.0143 1.0018 1.0038 1.0049 1.0018 0.9875 1.0035 0.9742 0.9978 1.0145 0.9895 0.9898 0.9890
dispcorr: -0.035455373 hartree
energy: -1560.141723704707
dipole: 19.25520 -19.41371 -0.15850 -4.25318 3.71080 -0.54238 6.54165 -7.19036 -0.64871
magnitude: 0.86031 au
magnitude: 2.18673 debye
