program: Orca
programVersion: 5.0.2
elementType: F F O O O O N C C C C C C C C C C C C C C C C C C C C C C C C C C H H H H H H H H H H H H H H H H H H H H H H H
charge: 0
multiplicity: 1
keywords: wb97x-d3
keywords: def2-TZVPP
keywords: def2/J RIJCOSX
keywords: DEFGRID2
keywords: scfconv7
keywords: smallprint printgap noloewdin
keywords: NOSOSCF
formula: C26H23F2NO4
InChI: InChI=1/C26H23F2NO4/c1-17(2)24(18-11-13-21(14-12-18)32-26(27)28)25(30)33-23(16-29)19-7-6-10-22(15-19)31-20-8-4-3-5-9-20/h3-15,17,23-24,26H,1-2H3
56 atoms
F  -3.494603 -3.765067 2.461095
F  -4.491169 -1.863861 2.24461
O  2.615701 0.314757 -0.14595
O  3.822214 -0.75727 1.390236
O  -2.860196 -2.32308 0.891009
O  -1.266143 3.204731 -1.735927
N  1.783722 1.457247 2.949176
C  2.67902 -2.033164 -0.323639
C  3.080186 -2.037584 -1.809295
C  1.193155 -2.164211 -0.048612
C  4.581916 -1.820127 -1.960399
C  2.668912 -3.356626 -2.450094
C  3.133349 -0.789538 0.403536
C  0.765664 -2.913605 1.039514
C  0.23226 -1.495501 -0.805665
C  2.784514 1.549158 0.531133
C  -0.577807 -2.999232 1.382474
C  -1.108774 -1.556473 -0.471301
C  -1.509142 -2.301764 0.629622
C  2.030644 2.604105 -0.238815
C  0.708777 2.36583 -0.60634
C  2.654218 3.801359 -0.547698
C  0.012689 3.353395 -1.285368
C  2.236935 1.4652 1.892214
C  1.943022 4.778495 -1.233089
C  0.626961 4.563451 -1.598302
C  -3.286329 -2.457026 2.176189
C  -2.146604 2.308235 -1.180213
C  -2.948133 1.601395 -2.065458
C  -2.308661 2.16806 0.192694
C  -3.93643 0.761807 -1.571688
C  -3.285921 1.30612 0.671549
C  -4.108777 0.6092 -0.20355
H  3.19211 -2.8681 0.161372
H  2.56427 -1.224955 -2.327851
H  5.146487 -2.591112 -1.431847
H  4.907747 -0.84922 -1.582321
H  4.868601 -1.863103 -3.01161
H  3.152406 -4.200232 -1.952844
H  1.591594 -3.518854 -2.409285
H  2.963347 -3.378149 -3.499896
H  1.490361 -3.45156 1.638206
H  0.518854 -0.90578 -1.666604
H  3.842774 1.815939 0.610008
H  -0.865957 -3.617035 2.222673
H  -1.842607 -1.022035 -1.061439
H  0.236258 1.422227 -0.361105
H  3.683382 3.971195 -0.259381
H  2.418754 5.717266 -1.482317
H  0.072372 5.324344 -2.132439
H  -2.614226 -2.027177 2.921825
H  -2.808965 1.721229 -3.132401
H  -1.692395 2.725455 0.886803
H  -4.567538 0.219794 -2.263645
H  -3.411458 1.19221 1.74043
H  -4.876707 -0.049232 0.177351
elementType: F O N C H
totalener: -1560.10622819 hartree
nucrepener: 3438.62627806 hartree
electener: -4998.73250625 hartree
oneelecener: -8968.28060054 hartree
twoeener: 3969.54809428 hartree
cpcmener: -0.04483170 hartree
kineticenergy: 1553.62041713 hartree
xcener: -146.817084861282 hartree
chargesum: 0.0000000
charge: -0.211431 -0.204141 -0.268033 -0.437052 -0.291820 -0.330562 -0.100223 0.170161 0.033782 0.008702 -0.299138 -0.297539 0.329830 -0.207795 -0.255370 0.413414 -0.146919 -0.191136 0.217242 -0.009618 -0.233560 -0.208599 0.309036 -0.227611 -0.104083 -0.252193 0.400567 0.313586 -0.258004 -0.207451 -0.102216 -0.132708 -0.212045 0.096972 0.056297 0.095374 0.091663 0.095204 0.091259 0.099556 0.096880 0.143840 0.148185 0.139318 0.147621 0.178991 0.145293 0.148595 0.162097 0.148683 0.130708 0.145584 0.158686 0.158940 0.158843 0.154340
qa: -0.2114 -0.2041 -0.2680 -0.4371 -0.2918 -0.3306 -0.1002 0.1702 0.0338 0.0087 -0.2991 -0.2975 0.3298 -0.2078 -0.2554 0.4134 -0.1469 -0.1911 0.2172 -0.0096 -0.2336 -0.2086 0.3090 -0.2276 -0.1041 -0.2522 0.4006 0.3136 -0.2580 -0.2075 -0.1022 -0.1327 -0.2120 0.0970 0.0563 0.0954 0.0917 0.0952 0.0913 0.0996 0.0969 0.1438 0.1482 0.1393 0.1476 0.1790 0.1453 0.1486 0.1621 0.1487 0.1307 0.1456 0.1587 0.1589 0.1588 0.1543
va: 1.0524 1.0693 2.1535 2.0595 2.0440 2.0900 3.1069 3.6266 3.8353 3.5543 3.9388 3.9280 4.2174 4.0400 3.9842 3.7387 3.8794 3.9250 3.8776 3.7607 3.9601 3.9490 3.7307 4.0273 3.8898 3.9956 4.2198 3.6259 4.0017 3.9080 3.8507 3.8077 3.8480 1.0293 1.0233 1.0031 1.0093 1.0035 1.0019 1.0016 1.0051 1.0059 1.0078 1.0151 1.0114 0.9890 1.0103 1.0020 0.9882 1.0069 0.9779 1.0089 0.9972 0.9898 0.9933 1.0075
dispcorr: -0.034841762 hartree
energy: -1560.141069955959
dipole: 24.22176 -22.94544 1.27632 -1.80079 2.22248 0.42169 -21.64118 19.50106 -2.14011
magnitude: 2.52723 au
magnitude: 6.42371 debye
