program: Orca
programVersion: 5.0.2
elementType: F F O O O O N C C C C C C C C C C C C C C C C C C C C C C C C C C H H H H H H H H H H H H H H H H H H H H H H H
charge: 0
multiplicity: 1
keywords: wb97x-d3
keywords: def2-TZVPP
keywords: def2/J RIJCOSX
keywords: DEFGRID2
keywords: scfconv7
keywords: smallprint printgap noloewdin
keywords: NOSOSCF
formula: C26H23F2NO4
InChI: InChI=1/C26H23F2NO4/c1-17(2)24(18-11-13-21(14-12-18)32-26(27)28)25(30)33-23(16-29)19-7-6-10-22(15-19)31-20-8-4-3-5-9-20/h3-15,17,23-24,26H,1-2H3
56 atoms
F  -4.143857 -2.402845 0.924905
F  -3.348043 -3.724395 -0.584334
O  3.150414 0.181057 -0.614885
O  3.132017 0.400442 1.602981
O  -2.939864 -1.538414 -0.761236
O  -1.451489 2.185066 -1.310578
N  5.506259 2.436628 0.352633
C  2.563512 -1.740011 0.637218
C  3.472598 -2.653128 -0.203001
C  1.097796 -1.754678 0.251592
C  4.925121 -2.511704 0.239999
C  3.013657 -4.099469 -0.066401
C  2.987654 -0.291449 0.629285
C  0.131191 -1.764208 1.250872
C  0.677455 -1.693318 -1.073899
C  3.304962 1.585331 -0.772405
C  -1.22272 -1.714209 0.95362
C  -0.671624 -1.654631 -1.38774
C  -1.616451 -1.659964 -0.374308
C  2.054612 2.338595 -0.377157
C  0.863423 1.937424 -0.975654
C  2.054627 3.381629 0.535452
C  -0.315335 2.586229 -0.656041
C  4.520863 2.054952 -0.101363
C  0.864999 4.036033 0.831011
C  -0.325628 3.646539 0.242339
C  -3.842747 -2.480746 -0.395853
C  -2.569144 1.828297 -0.6018
C  -3.760728 1.805742 -1.316823
C  -2.540939 1.45558 0.735943
C  -4.92848 1.402086 -0.68844
C  -3.721355 1.061961 1.35229
C  -4.917301 1.030393 0.649852
H  2.641579 -2.062832 1.678974
H  3.40328 -2.368577 -1.2564
H  5.563801 -3.19208 -0.324282
H  5.037369 -2.755106 1.298764
H  5.317516 -1.504506 0.085272
H  3.046038 -4.423645 0.976149
H  1.996138 -4.246535 -0.429567
H  3.664007 -4.760982 -0.639853
H  0.43608 -1.804529 2.289204
H  1.396552 -1.679947 -1.882594
H  3.480454 1.717572 -1.843019
H  -1.939554 -1.693622 1.761336
H  -0.989156 -1.607115 -2.421331
H  0.845526 1.13024 -1.697792
H  2.969195 3.701068 1.017977
H  0.867804 4.858636 1.533232
H  -1.247415 4.163672 0.47661
H  -4.75085 -2.341125 -0.978335
H  -3.768596 2.095822 -2.359947
H  -1.618082 1.452341 1.300297
H  -5.85272 1.383996 -1.250987
H  -3.695526 0.768722 2.393626
H  -5.830709 0.72061 1.139452
elementType: F O N C H
totalener: -1560.10348081 hartree
nucrepener: 3504.63869252 hartree
electener: -5064.74217332 hartree
oneelecener: -9101.54080508 hartree
twoeener: 4036.79863175 hartree
cpcmener: -0.04557960 hartree
kineticenergy: 1553.64647500 hartree
xcener: -146.823837643327 hartree
chargesum: -0.0000000
charge: -0.217433 -0.215109 -0.271623 -0.437084 -0.333767 -0.339295 -0.090563 0.186828 0.043776 0.002083 -0.298896 -0.300509 0.329685 -0.196491 -0.227611 0.451364 -0.166808 -0.185060 0.241513 -0.002100 -0.308810 -0.175156 0.269028 -0.241432 -0.125682 -0.188126 0.434752 0.349312 -0.282616 -0.194161 -0.111079 -0.171067 -0.210751 0.100165 0.055257 0.094768 0.095160 0.090997 0.091251 0.099453 0.097146 0.141918 0.146780 0.145529 0.149775 0.147677 0.156620 0.137526 0.164262 0.161933 0.134781 0.145556 0.148205 0.159058 0.159591 0.159484
qa: -0.2174 -0.2151 -0.2716 -0.4371 -0.3338 -0.3393 -0.0906 0.1868 0.0438 0.0021 -0.2989 -0.3005 0.3297 -0.1965 -0.2276 0.4514 -0.1668 -0.1851 0.2415 -0.0021 -0.3088 -0.1752 0.2690 -0.2414 -0.1257 -0.1881 0.4348 0.3493 -0.2826 -0.1942 -0.1111 -0.1711 -0.2108 0.1002 0.0553 0.0948 0.0952 0.0910 0.0913 0.0995 0.0971 0.1419 0.1468 0.1455 0.1498 0.1477 0.1566 0.1375 0.1643 0.1619 0.1348 0.1456 0.1482 0.1591 0.1596 0.1595
va: 1.0536 1.0658 2.1251 2.0667 2.0247 2.0464 3.1010 3.6184 3.8342 3.5141 3.9432 3.9300 4.1873 4.0299 3.9039 3.8672 3.9455 4.0175 3.6113 3.7266 4.0645 3.9202 3.7451 4.0725 3.9156 3.9528 4.2244 3.5642 4.0098 3.8109 3.8627 3.8734 3.8777 1.0288 1.0227 1.0038 1.0028 1.0099 1.0021 1.0014 1.0049 1.0055 1.0093 0.9930 1.0125 1.0045 1.0068 1.0152 0.9891 0.9930 0.9772 1.0101 1.0035 0.9884 0.9912 0.9899
dispcorr: -0.037392511 hartree
energy: -1560.140873318568
dipole: 17.23566 -18.81787 -1.58221 -5.90361 5.13887 -0.76474 1.06391 -2.45481 -1.39090
magnitude: 2.24117 au
magnitude: 5.69660 debye
