program: Orca
programVersion: 5.0.2
elementType: F F O O O O N C C C C C C C C C C C C C C C C C C C C C C C C C C H H H H H H H H H H H H H H H H H H H H H H H
charge: 0
multiplicity: 1
keywords: wb97x-d3
keywords: def2-TZVPP
keywords: def2/J RIJCOSX
keywords: DEFGRID2
keywords: scfconv7
keywords: smallprint printgap noloewdin
keywords: NOSOSCF
formula: C26H23F2NO4
InChI: InChI=1/C26H23F2NO4/c1-17(2)24(18-11-13-21(14-12-18)32-26(27)28)25(30)33-23(16-29)19-7-6-10-22(15-19)31-20-8-4-3-5-9-20/h3-15,17,23-24,26H,1-2H3
56 atoms
F  -3.600995 -3.127498 1.440074
F  -4.787534 -1.672571 0.370148
O  3.406951 0.388996 0.692884
O  3.536661 -0.045053 -1.495754
O  -2.737002 -1.946964 -0.238217
O  -1.381711 1.648551 0.710695
N  4.091759 2.942614 2.669508
C  2.930109 -1.818379 0.038726
C  3.568932 -2.9174 -0.822844
C  1.41399 -1.818058 -0.006485
C  5.086529 -2.902772 -0.674121
C  3.017152 -4.279328 -0.419372
C  3.348716 -0.428769 -0.371068
C  0.727639 -1.631744 -1.205389
C  0.673486 -2.013605 1.149883
C  3.439243 1.782978 0.421517
C  -0.653614 -1.662639 -1.245657
C  -0.715882 -2.057303 1.128862
C  -1.374711 -1.88589 -0.079398
C  2.089455 2.291754 -0.033142
C  0.935331 1.746577 0.511307
C  2.016189 3.30531 -0.977148
C  -0.302689 2.219556 0.101812
C  3.810232 2.414435 1.687807
C  0.7712 3.785807 -1.356273
C  -0.39335 3.254661 -0.82224
C  -3.556031 -1.907742 0.847683
C  -2.615276 1.626024 0.109573
C  -2.783741 1.296367 -1.229362
C  -3.710428 1.87917 0.922939
C  -4.067533 1.236725 -1.752342
C  -4.989192 1.804588 0.388392
C  -5.173306 1.491683 -0.951421
H  3.23629 -1.977041 1.076904
H  3.314667 -2.736905 -1.871824
H  5.538711 -3.687637 -1.281801
H  5.377368 -3.081063 0.363761
H  5.533703 -1.957624 -0.985966
H  3.200934 -4.479923 0.638945
H  1.943487 -4.360706 -0.590748
H  3.499803 -5.071007 -0.993589
H  1.267663 -1.468098 -2.129413
H  1.182722 -2.154086 2.095224
H  4.211004 2.036432 -0.312263
H  -1.176777 -1.525196 -2.183352
H  -1.239454 -2.242644 2.056915
H  0.978733 0.960181 1.255119
H  2.919466 3.717228 -1.408601
H  0.701934 4.58508 -2.081938
H  -1.352379 3.650354 -1.129268
H  -3.28879 -1.155478 1.592565
H  -1.931089 1.085032 -1.862223
H  -3.561471 2.128492 1.966167
H  -4.200559 0.983557 -2.796053
H  -5.842414 2.001302 1.024376
H  -6.170627 1.440443 -1.367427
elementType: F O N C H
totalener: -1560.10797650 hartree
nucrepener: 3474.58986337 hartree
electener: -5034.69783987 hartree
oneelecener: -9040.51310155 hartree
twoeener: 4005.81526168 hartree
cpcmener: -0.04375979 hartree
kineticenergy: 1553.62103907 hartree
xcener: -146.817371585525 hartree
chargesum: -0.0000000
charge: -0.212015 -0.197531 -0.282053 -0.443616 -0.277982 -0.332288 -0.098820 0.145685 0.065507 -0.056254 -0.293667 -0.316519 0.337004 -0.139749 -0.215801 0.402657 -0.245725 -0.136914 0.266200 0.044893 -0.280632 -0.207315 0.283886 -0.226353 -0.131477 -0.202791 0.383057 0.392264 -0.265170 -0.306109 -0.117619 -0.090598 -0.213314 0.093667 0.047573 0.094350 0.090259 0.094338 0.091366 0.097567 0.099044 0.141801 0.141308 0.148084 0.149368 0.139480 0.153145 0.148297 0.163459 0.159671 0.130706 0.159140 0.145569 0.161281 0.160151 0.159535
qa: -0.2120 -0.1975 -0.2821 -0.4436 -0.2780 -0.3323 -0.0988 0.1457 0.0655 -0.0563 -0.2937 -0.3165 0.3370 -0.1397 -0.2158 0.4027 -0.2457 -0.1369 0.2662 0.0449 -0.2806 -0.2073 0.2839 -0.2264 -0.1315 -0.2028 0.3831 0.3923 -0.2652 -0.3061 -0.1176 -0.0906 -0.2133 0.0937 0.0476 0.0944 0.0903 0.0943 0.0914 0.0976 0.0990 0.1418 0.1413 0.1481 0.1494 0.1395 0.1531 0.1483 0.1635 0.1597 0.1307 0.1591 0.1456 0.1613 0.1602 0.1595
va: 1.0577 1.0723 2.1367 2.0472 2.0367 2.0354 3.1109 3.6794 3.8025 3.4995 3.9256 3.9523 4.2205 3.9285 3.9817 3.7177 3.9893 3.8867 3.7375 3.6257 4.0306 3.9873 3.7550 4.0870 3.8966 3.9197 4.2529 3.4314 3.8932 4.0164 3.8775 3.8255 3.9147 1.0414 1.0261 1.0041 1.0021 1.0118 1.0018 0.9998 1.0045 1.0182 1.0051 1.0156 1.0044 1.0148 1.0144 1.0009 0.9890 0.9947 0.9700 0.9961 1.0097 0.9888 0.9874 0.9901
dispcorr: -0.036446837 hartree
energy: -1560.144423334649
dipole: 21.13373 -21.33349 -0.19976 -7.80893 7.61684 -0.19209 -10.11891 9.21645 -0.90246
magnitude: 0.94405 au
magnitude: 2.39958 debye
