program: Orca
programVersion: 5.0.2
elementType: F F O O O O N C C C C C C C C C C C C C C C C C C C C C C C C C C H H H H H H H H H H H H H H H H H H H H H H H
charge: 0
multiplicity: 1
keywords: wb97x-d3
keywords: def2-TZVPP
keywords: def2/J RIJCOSX
keywords: DEFGRID2
keywords: scfconv7
keywords: smallprint printgap noloewdin
keywords: NOSOSCF
formula: C26H23F2NO4
InChI: InChI=1/C26H23F2NO4/c1-17(2)24(18-11-13-21(14-12-18)32-26(27)28)25(30)33-23(16-29)19-7-6-10-22(15-19)31-20-8-4-3-5-9-20/h3-15,17,23-24,26H,1-2H3
56 atoms
F  -3.484076 -2.982043 1.869521
F  -4.723484 -1.535411 0.854513
O  3.356768 0.317059 0.694667
O  3.436542 0.080683 -1.526181
O  -2.742747 -1.879305 0.079737
O  -1.449254 1.64331 0.609549
N  3.952292 2.687219 2.910818
C  2.929506 -1.838819 -0.135031
C  3.513108 -2.829407 -1.152595
C  1.414897 -1.850606 -0.053997
C  5.037546 -2.80816 -1.105589
C  3.000026 -4.236194 -0.87011
C  3.293581 -0.405661 -0.435394
C  0.774199 -2.053793 1.159237
C  0.631465 -1.633083 -1.186148
C  3.39108 1.729244 0.545617
C  -0.612095 -2.065555 1.259201
C  -0.748461 -1.640144 -1.106415
C  -1.370592 -1.858536 0.116493
C  2.065581 2.283813 0.073929
C  0.882075 1.720079 0.530603
C  2.043468 3.354707 -0.806974
C  -0.3306 2.232394 0.094295
C  3.707365 2.248063 1.876364
C  0.822555 3.873374 -1.212706
C  -0.369546 3.32297 -0.767348
C  -3.462193 -1.785147 1.232397
C  -2.615367 1.589328 -0.112726
C  -2.636927 1.278777 -1.466932
C  -3.794991 1.78818 0.589326
C  -3.859016 1.171458 -2.114778
C  -5.010026 1.667853 -0.070019
C  -5.048045 1.363932 -1.423584
H  3.322363 -2.091747 0.854253
H  3.189134 -2.53907 -2.156497
H  5.399382 -3.096911 -0.116276
H  5.454257 -1.827514 -1.338189
H  5.452008 -3.513789 -1.826597
H  1.917674 -4.312657 -0.974762
H  3.446373 -4.949349 -1.564222
H  3.260941 -4.553246 0.142442
H  1.360471 -2.219277 2.054462
H  1.092602 -1.460237 -2.150407
H  4.195142 2.043474 -0.128235
H  -1.058612 -2.25228 2.226166
H  -1.348089 -1.481281 -1.99323
H  0.883333 0.886246 1.222558
H  2.969565 3.781365 -1.169913
H  0.7953 4.717183 -1.888908
H  -1.311468 3.744881 -1.092307
H  -3.112183 -1.015116 1.924432
H  -1.71814 1.114787 -2.015195
H  -3.760656 2.026462 1.644908
H  -3.87756 0.929232 -3.169298
H  -5.929232 1.819652 0.480225
H  -5.996135 1.274837 -1.936842
elementType: F O N C H
totalener: -1560.10809075 hartree
nucrepener: 3481.90800134 hartree
electener: -5042.01609210 hartree
oneelecener: -9055.24104568 hartree
twoeener: 4013.22495358 hartree
cpcmener: -0.04426010 hartree
kineticenergy: 1553.62571505 hartree
xcener: -146.818760839002 hartree
chargesum: -0.0000000
charge: -0.211194 -0.196431 -0.278736 -0.441627 -0.278834 -0.334720 -0.099662 0.140090 0.063654 -0.029292 -0.294734 -0.313682 0.334013 -0.233551 -0.162090 0.398675 -0.124381 -0.224231 0.250000 0.036736 -0.279234 -0.202611 0.275269 -0.224161 -0.130384 -0.196617 0.378350 0.367414 -0.242995 -0.279652 -0.138753 -0.128508 -0.182090 0.097740 0.046843 0.089921 0.095026 0.094288 0.097561 0.098522 0.091095 0.140517 0.141993 0.148086 0.140349 0.150161 0.158862 0.147728 0.163734 0.159378 0.134583 0.160034 0.145284 0.162205 0.159361 0.160699
qa: -0.2112 -0.1964 -0.2787 -0.4416 -0.2788 -0.3347 -0.0997 0.1401 0.0637 -0.0293 -0.2947 -0.3137 0.3340 -0.2336 -0.1621 0.3987 -0.1244 -0.2242 0.2500 0.0367 -0.2792 -0.2026 0.2753 -0.2242 -0.1304 -0.1966 0.3783 0.3674 -0.2430 -0.2797 -0.1388 -0.1285 -0.1821 0.0977 0.0468 0.0899 0.0950 0.0943 0.0976 0.0985 0.0911 0.1405 0.1420 0.1481 0.1403 0.1502 0.1589 0.1477 0.1637 0.1594 0.1346 0.1600 0.1453 0.1622 0.1594 0.1607
va: 1.0566 1.0730 2.1427 2.0505 2.0386 2.0301 3.1104 3.6751 3.8046 3.4685 3.9263 3.9495 4.2275 4.0175 3.9492 3.7253 3.8765 3.9753 3.7644 3.6222 4.0281 3.9814 3.7709 4.0874 3.8939 3.9206 4.2448 3.4559 3.8900 3.9801 3.9038 3.8439 3.9036 1.0385 1.0264 1.0022 1.0120 1.0040 1.0004 1.0045 1.0018 1.0063 1.0163 1.0141 1.0149 1.0016 1.0076 1.0009 0.9890 0.9949 0.9718 0.9959 1.0094 0.9891 0.9882 0.9888
dispcorr: -0.036602995 hartree
energy: -1560.144693749268
dipole: 21.40379 -21.35370 0.05008 -7.82949 7.71198 -0.11751 -14.61748 13.47242 -1.14507
magnitude: 1.15217 au
magnitude: 2.92859 debye
