program: Orca
programVersion: 5.0.2
elementType: Cl Cl F O O O N C C C C C C C C C C C C C C C C C C C C C C C C C C C C H H H H H H H H H H H H H H H H H H H H H H
charge: 0
multiplicity: 1
keywords: wb97x-d3
keywords: def2-TZVPP
keywords: def2/J RIJCOSX
keywords: DEFGRID2
keywords: scfconv7
keywords: smallprint printgap noloewdin
keywords: NOSOSCF
formula: C28H22Cl2FNO3
InChI: InChI=1/C28H22Cl2FNO3/c1-28(2)21(15-22(30)17-8-11-19(29)12-9-17)26(28)27(33)35-25(16-32)18-10-13-23(31)24(14-18)34-20-6-4-3-5-7-20/h3-15,21,25-26H,1-2H3
57 atoms
Cl 0.99325 0.219705 1.653133
Cl 7.376631 -0.491001 -0.937864
F  -3.433329 -4.219907 -0.978517
O  -3.006841 1.922541 0.164868
O  -3.158533 1.952251 -2.064019
O  -1.673945 -2.97996 0.639396
N  -5.125589 1.464471 2.659888
C  -0.741283 3.97527 -0.217802
C  -0.223842 2.607659 0.105213
C  -1.187508 2.796896 -1.059502
C  0.147773 4.973625 -0.922503
C  -1.677845 4.63392 0.767703
C  1.151377 2.174107 -0.163116
C  -2.536516 2.196424 -1.0692
C  1.783639 1.153833 0.420405
C  -4.218872 1.190092 0.224311
C  3.157092 0.737541 0.100068
C  -4.007612 -0.268616 -0.103273
C  4.005658 0.203421 1.067582
C  3.643497 0.865752 -1.20057
C  -4.711492 1.352349 1.594638
C  5.300782 -0.170911 0.755789
C  4.936481 0.495884 -1.525773
C  -2.911988 -0.94377 0.419338
C  -4.907862 -0.935695 -0.918649
C  5.76429 -0.02106 -0.541628
C  -2.714197 -2.281067 0.121402
C  -4.728004 -2.278824 -1.207296
C  -3.62982 -2.936968 -0.69308
C  -0.409572 -2.753218 0.169095
C  0.621508 -3.32228 0.90479
C  -0.13565 -2.015292 -0.97375
C  1.93149 -3.143091 0.496785
C  1.18493 -1.843947 -1.365857
C  2.223588 -2.399277 -0.63788
H  -0.669818 2.159146 0.983946
H  -0.751001 2.765913 -2.051229
H  0.756445 4.528216 -1.708799
H  0.820579 5.45716 -0.21248
H  -0.457952 5.751193 -1.389741
H  -1.101146 5.253704 1.45581
H  -2.245573 3.927298 1.367019
H  -2.384806 5.286957 0.25282
H  1.721593 2.734526 -0.894831
H  -4.965193 1.614467 -0.455693
H  3.655317 0.072842 2.081981
H  2.994216 1.22996 -1.985863
H  -2.193469 -0.441691 1.056584
H  5.947434 -0.577561 1.52079
H  5.293394 0.594649 -2.541514
H  -5.753854 -0.409061 -1.340473
H  -5.422128 -2.810864 -1.843366
H  0.388602 -3.897546 1.791124
H  -0.929621 -1.571739 -1.559818
H  2.732078 -3.583265 1.076387
H  1.397522 -1.264792 -2.254923
H  3.249416 -2.249904 -0.946661
totalener: -2380.98011507 hartree
nucrepener: 4034.87588133 hartree
electener: -6415.85599640 hartree
twoeener: 4872.89447740 hartree
kineticenergy: 2373.57532051 hartree
xcener: -182.600089811172 hartree
chargesum: 0.0000000
charge: -0.096568 -0.070230 -0.181669 -0.280121 -0.337001 -0.294217 0.005658 0.075154 0.035602 -0.057604 -0.270215 -0.250446 -0.110243 0.305383 0.016698 0.278884 0.145504 0.027257 -0.160700 -0.248591 -0.260538 -0.132197 -0.124773 -0.140773 -0.104078 0.085539 0.113340 -0.164331 0.233908 0.258017 -0.183481 -0.144580 -0.108982 -0.157753 -0.121391 0.088694 0.084822 0.073448 0.103512 0.097900 0.089934 0.097962 0.093771 0.097150 0.126213 0.116342 0.121972 0.126297 0.123539 0.121581 0.110536 0.127206 0.122626 0.121035 0.120841 0.122027 0.132129
qa: -0.0966 -0.0702 -0.1817 -0.2801 -0.3370 -0.2942 0.0057 0.0752 0.0356 -0.0576 -0.2702 -0.2504 -0.1102 0.3054 0.0167 0.2789 0.1455 0.0273 -0.1607 -0.2486 -0.2605 -0.1322 -0.1248 -0.1408 -0.1041 0.0855 0.1133 -0.1643 0.2339 0.2580 -0.1835 -0.1446 -0.1090 -0.1578 -0.1214 0.0887 0.0848 0.0734 0.1035 0.0979 0.0899 0.0980 0.0938 0.0971 0.1262 0.1163 0.1220 0.1263 0.1235 0.1216 0.1105 0.1272 0.1226 0.1210 0.1208 0.1220 0.1321
va: 1.2444 1.2350 1.1239 2.0930 2.1704 2.1213 3.1142 3.7944 3.7505 3.8255 3.9232 3.9150 3.8321 4.2794 3.8473 3.8648 3.5068 3.6701 3.9875 4.0160 4.0068 4.0034 4.0091 3.9867 3.9640 3.9492 3.8112 3.9275 4.1002 3.7800 3.9921 3.8693 3.9663 3.9354 3.8990 1.0410 1.0297 1.0096 1.0007 1.0035 1.0025 1.0123 1.0015 1.0160 1.0180 1.0312 1.0090 1.0231 1.0130 1.0143 1.0108 1.0073 1.0142 1.0158 1.0018 1.0027 0.9875
dispcorr: -0.038137193 hartree
energy: -2381.018252258777
dipole: -6.30019 6.97822 0.67804 26.73142 -25.62976 1.10166 -5.53745 4.56880 -0.96865
magnitude: 1.61606 au
magnitude: 4.10771 debye
