program: Orca
programVersion: 5.0.2
elementType: Cl Cl F O O O N C C C C C C C C C C C C C C C C C C C C C C C C C C C C H H H H H H H H H H H H H H H H H H H H H H
charge: 0
multiplicity: 1
keywords: wb97x-d3
keywords: def2-TZVPP
keywords: def2/J RIJCOSX
keywords: DEFGRID2
keywords: scfconv7
keywords: smallprint printgap noloewdin
keywords: NOSOSCF
formula: C28H22Cl2FNO3
InChI: InChI=1/C28H22Cl2FNO3/c1-28(2)21(15-22(30)17-8-11-19(29)12-9-17)26(28)27(33)35-25(16-32)18-10-13-23(31)24(14-18)34-20-6-4-3-5-7-20/h3-15,21,25-26H,1-2H3
57 atoms
Cl 0.413458 0.119547 2.02106
Cl 7.197432 -0.714166 0.837024
F  -1.693234 -3.499946 1.936589
O  -3.158028 1.912311 -0.435938
O  -2.556004 1.405705 -2.532434
O  -1.59485 -3.23074 -0.73827
N  -6.217095 1.924011 0.823801
C  -0.797365 3.835716 -0.310408
C  -0.38141 2.473469 0.156391
C  -1.050258 2.648183 -1.207589
C  0.246024 4.805252 -0.817901
C  -1.914603 4.532375 0.43009
C  1.003646 1.99969 0.205306
C  -2.317941 1.946673 -1.488687
C  1.475475 1.010037 0.965974
C  -4.174018 0.910543 -0.446895
C  2.87809 0.57038 0.968333
C  -3.625378 -0.333133 0.207379
C  3.218794 -0.781421 0.976229
C  3.902255 1.514679 0.934082
C  -5.314457 1.484333 0.266358
C  4.542664 -1.179168 0.927701
C  5.230581 1.127757 0.887739
C  -2.928914 -1.240872 -0.581632
C  -3.688096 -0.521236 1.582067
C  5.54446 -0.221454 0.883558
C  -2.271168 -2.314874 -0.002534
C  -3.052341 -1.604298 2.16553
C  -2.334056 -2.479039 1.375378
C  -0.588309 -2.807768 -1.56443
C  -0.316449 -3.597477 -2.672269
C  0.16369 -1.670177 -1.305622
C  0.720461 -3.245081 -3.521077
C  1.196332 -1.329641 -2.166286
C  1.480815 -2.110634 -3.275436
H  -1.029308 2.046861 0.912585
H  -0.389443 2.582037 -2.064405
H  1.026028 4.329272 -1.411544
H  0.726853 5.319971 0.0154
H  -0.220581 5.561151 -1.450831
H  -1.489424 5.171969 1.205072
H  -2.605433 3.848452 0.91376
H  -2.488724 5.169213 -0.244567
H  1.720001 2.461165 -0.465319
H  -4.492302 0.698713 -1.471774
H  2.445278 -1.537214 1.006192
H  3.660945 2.568968 0.970743
H  -2.875604 -1.11003 -1.655551
H  4.793937 -2.23049 0.923068
H  6.015699 1.870723 0.872214
H  -4.236142 0.170397 2.20875
H  -3.095455 -1.764383 3.23426
H  -0.913265 -4.48024 -2.85978
H  -0.042087 -1.053063 -0.44167
H  0.930278 -3.862267 -4.384605
H  1.785068 -0.446425 -1.954405
H  2.287808 -1.839282 -3.942129
totalener: -2380.98027246 hartree
nucrepener: 4045.78667290 hartree
electener: -6426.76694535 hartree
twoeener: 4883.43878573 hartree
kineticenergy: 2373.56114658 hartree
xcener: -182.593620127218 hartree
chargesum: 0.0000000
charge: -0.095978 -0.069546 -0.181586 -0.267523 -0.346157 -0.295427 -0.000419 0.063237 0.047954 -0.037965 -0.266242 -0.235407 -0.168991 0.308359 0.053154 0.288268 0.108215 -0.028114 -0.194960 -0.212153 -0.262766 -0.124148 -0.122902 -0.124240 -0.135630 0.087328 0.156538 -0.164136 0.204341 0.248164 -0.198430 -0.121306 -0.092733 -0.123666 -0.146801 0.085252 0.085908 0.075206 0.098471 0.100701 0.087039 0.093818 0.093862 0.104348 0.131716 0.130933 0.131279 0.151712 0.124934 0.121411 0.123810 0.129570 0.126594 0.080950 0.125187 0.124616 0.124350
qa: -0.0960 -0.0695 -0.1816 -0.2675 -0.3462 -0.2954 -0.0004 0.0632 0.0480 -0.0380 -0.2662 -0.2354 -0.1690 0.3084 0.0532 0.2883 0.1082 -0.0281 -0.1950 -0.2122 -0.2628 -0.1241 -0.1229 -0.1242 -0.1356 0.0873 0.1565 -0.1641 0.2043 0.2482 -0.1984 -0.1213 -0.0927 -0.1237 -0.1468 0.0853 0.0859 0.0752 0.0985 0.1007 0.0870 0.0938 0.0939 0.1043 0.1317 0.1309 0.1313 0.1517 0.1249 0.1214 0.1238 0.1296 0.1266 0.0810 0.1252 0.1246 0.1243
va: 1.2473 1.2372 1.1205 2.0827 2.1515 2.1279 3.1088 3.8189 3.7681 3.7874 3.9210 3.9046 3.8146 4.2768 3.9046 3.8541 3.5252 3.7100 4.0008 4.0346 4.0199 4.0477 4.0098 3.8938 3.9434 3.9505 3.7826 3.9163 4.0918 3.8268 4.0195 3.7973 3.9525 3.9436 3.9974 1.0421 1.0293 1.0097 1.0017 1.0036 1.0016 1.0174 1.0039 1.0174 1.0201 1.0167 1.0087 1.0125 1.0126 1.0141 1.0174 1.0065 1.0132 1.0596 0.9981 0.9998 1.0006
dispcorr: -0.037294481 hartree
energy: -2381.017566936663
dipole: -7.27858 8.46121 1.18263 25.89133 -25.03940 0.85193 -15.24138 14.90908 -0.33231
magnitude: 1.49493 au
magnitude: 3.79982 debye
