program: Orca
programVersion: 5.0.2
elementType: Cl Cl F O O O N C C C C C C C C C C C C C C C C C C C C C C C C C C C C H H H H H H H H H H H H H H H H H H H H H H
charge: 0
multiplicity: 1
keywords: wb97x-d3
keywords: def2-TZVPP
keywords: def2/J RIJCOSX
keywords: DEFGRID2
keywords: scfconv7
keywords: smallprint printgap noloewdin
keywords: NOSOSCF
formula: C28H22Cl2FNO3
InChI: InChI=1/C28H22Cl2FNO3/c1-28(2)21(15-22(30)17-8-11-19(29)12-9-17)26(28)27(33)35-25(16-32)18-10-13-23(31)24(14-18)34-20-6-4-3-5-7-20/h3-15,21,25-26H,1-2H3
57 atoms
Cl 1.883767 2.143934 2.215277
Cl 7.562692 -0.79191 -0.55769
F  -4.232081 -4.647791 -0.067092
O  -2.934093 1.473503 -0.203226
O  -3.094441 2.389815 -2.245794
O  -1.98178 -3.415479 -0.682447
N  -5.597606 2.052951 1.684212
C  -0.560768 3.467059 0.068238
C  -0.172057 2.023059 0.026108
C  -1.046118 2.575024 -1.068347
C  0.459761 4.507413 -0.323717
C  -1.501315 3.935124 1.150486
C  1.19862 1.565175 -0.27912
C  -2.451963 2.165363 -1.261345
C  2.19376 1.563929 0.605403
C  -4.246137 0.95785 -0.268713
C  3.542094 1.041247 0.352803
C  -4.228956 -0.555786 -0.164686
C  4.268486 0.383599 1.34396
C  4.105149 1.145693 -0.919378
C  -5.002586 1.567264 0.830187
C  5.500834 -0.183026 1.068785
C  5.335804 0.583108 -1.2065
C  -3.064322 -1.259799 -0.443095
C  -5.394873 -1.239165 0.145116
C  6.028022 -0.086925 -0.209234
C  -3.05719 -2.646733 -0.402211
C  -5.39759 -2.625357 0.174585
C  -4.238074 -3.316473 -0.095624
C  -0.717041 -2.892254 -0.623806
C  -0.224708 -2.309454 0.537448
C  0.084576 -3.024568 -1.745548
C  1.084547 -1.855693 0.56353
C  1.398309 -2.579588 -1.69983
C  1.902633 -1.992779 -0.549993
H  -0.680889 1.400495 0.756975
H  -0.569667 2.779999 -2.021145
H  1.110189 4.174813 -1.132309
H  1.095708 4.754172 0.52751
H  -0.035525 5.423052 -0.64956
H  -0.920772 4.259382 2.015296
H  -2.186269 3.163386 1.492434
H  -2.093751 4.786527 0.811784
H  1.394148 1.133287 -1.254045
H  -4.720237 1.256986 -1.21042
H  3.868225 0.301321 2.345302
H  3.58394 1.688954 -1.696453
H  -2.149255 -0.739112 -0.6879
H  6.047898 -0.698367 1.845847
H  5.76076 0.67675 -2.196218
H  -6.307445 -0.704293 0.37474
H  -6.297993 -3.172977 0.417749
H  -0.854205 -2.219106 1.413881
H  -0.316873 -3.486643 -2.637815
H  1.471163 -1.3988 1.465093
H  2.028989 -2.694538 -2.571503
H  2.926968 -1.646278 -0.516622
totalener: -2380.97947354 hartree
nucrepener: 3943.98670903 hartree
electener: -6324.96618257 hartree
twoeener: 4781.34037017 hartree
kineticenergy: 2373.56045719 hartree
xcener: -182.596382454322 hartree
chargesum: 0.0000000
charge: -0.082985 -0.065532 -0.184874 -0.279607 -0.335866 -0.282810 -0.001409 0.086128 -0.084151 -0.085064 -0.245272 -0.254920 -0.098217 0.321796 0.063124 0.296287 0.052872 0.018457 -0.163575 -0.199586 -0.257624 -0.124567 -0.111440 -0.157495 -0.191632 0.085459 0.193257 -0.129556 0.170646 0.245956 -0.192848 -0.173836 -0.113150 -0.121568 -0.111769 0.106186 0.090853 0.077003 0.093037 0.103421 0.090677 0.092169 0.100910 0.107965 0.133837 0.120451 0.121110 0.128342 0.124246 0.123073 0.122676 0.126785 0.137026 0.129063 0.125515 0.127411 0.133617
qa: -0.0830 -0.0655 -0.1849 -0.2796 -0.3359 -0.2828 -0.0014 0.0861 -0.0842 -0.0851 -0.2453 -0.2549 -0.0982 0.3218 0.0631 0.2963 0.0529 0.0185 -0.1636 -0.1996 -0.2576 -0.1246 -0.1114 -0.1575 -0.1916 0.0855 0.1933 -0.1296 0.1706 0.2460 -0.1928 -0.1738 -0.1131 -0.1216 -0.1118 0.1062 0.0909 0.0770 0.0930 0.1034 0.0907 0.0922 0.1009 0.1080 0.1338 0.1205 0.1211 0.1283 0.1242 0.1231 0.1227 0.1268 0.1370 0.1291 0.1255 0.1274 0.1336
va: 1.2536 1.2409 1.1170 2.0757 2.1764 2.1270 3.1065 3.7708 3.8187 3.8720 3.9059 3.9137 3.6863 4.2748 3.8009 3.7847 3.5571 3.8137 3.9715 4.0085 3.9875 4.0302 3.9953 3.8912 4.0083 3.9572 3.7740 3.9196 4.1106 3.7846 3.9673 4.0288 3.8749 3.9616 3.8632 1.0272 1.0285 1.0059 1.0088 1.0053 1.0076 1.0139 1.0020 1.0106 1.0278 1.0321 1.0114 1.0197 1.0134 1.0136 1.0152 1.0073 1.0019 1.0112 1.0005 1.0004 0.9904
dispcorr: -0.036827882 hartree
energy: -2381.016301420855
dipole: -6.87380 8.09394 1.22013 19.51100 -19.39779 0.11321 -4.28068 3.76243 -0.51825
magnitude: 1.33046 au
magnitude: 3.38176 debye
