program: Orca
programVersion: 5.0.2
elementType: Cl Cl F O O O N C C C C C C C C C C C C C C C C C C C C C C C C C C C C H H H H H H H H H H H H H H H H H H H H H H
charge: 0
multiplicity: 1
keywords: wb97x-d3
keywords: def2-TZVPP
keywords: def2/J RIJCOSX
keywords: DEFGRID2
keywords: scfconv7
keywords: smallprint printgap noloewdin
keywords: NOSOSCF
formula: C28H22Cl2FNO3
InChI: InChI=1/C28H22Cl2FNO3/c1-28(2)21(15-22(30)17-8-11-19(29)12-9-17)26(28)27(33)35-25(16-32)18-10-13-23(31)24(14-18)34-20-6-4-3-5-7-20/h3-15,21,25-26H,1-2H3
57 atoms
Cl 2.457949 4.113551 -0.400784
Cl 8.644988 2.754867 2.43453
F  -6.100467 -2.132647 -2.470549
O  -1.846543 -0.304254 1.66965
O  -2.047106 1.573289 0.469692
O  -4.231576 -3.730745 -1.34121
N  -3.609082 -1.720633 4.084433
C  0.443293 0.337587 -1.001594
C  0.892299 1.449612 -0.097706
C  0.013593 0.347986 0.453715
C  1.409076 -0.75439 -1.394805
C  -0.537309 0.679026 -2.096637
C  2.27679 1.562704 0.377537
C  -1.379449 0.64621 0.835086
C  3.047084 2.650356 0.329975
C  -3.237376 -0.253254 1.955445
C  4.419454 2.713221 0.854517
C  -4.046231 -0.768851 0.791039
C  5.422648 3.420681 0.194203
C  4.750566 2.039485 2.029181
C  -3.428616 -1.078735 3.149581
C  6.720085 3.433291 0.673102
C  6.045522 2.043848 2.517713
C  -3.768124 -2.026266 0.268774
C  -5.030106 0.017042 0.212338
C  7.028231 2.739374 1.832648
C  -4.466164 -2.493609 -0.830219
C  -5.743949 -0.447824 -0.880923
C  -5.447893 -1.691283 -1.40055
C  -3.111831 -3.929061 -2.098279
C  -2.362789 -2.892643 -2.6378
C  -2.749171 -5.250928 -2.32503
C  -1.244098 -3.19024 -3.404617
C  -1.631897 -5.530266 -3.092723
C  -0.869842 -4.503737 -3.634739
H  0.380662 2.391426 -0.2609
H  0.495571 -0.3976 1.076314
H  2.082208 -1.043305 -0.588769
H  2.024378 -0.434262 -2.237034
H  0.862862 -1.649387 -1.697489
H  0.009514 0.943764 -3.002751
H  -1.18679 1.513625 -1.846648
H  -1.168904 -0.179153 -2.331597
H  2.735432 0.674946 0.798621
H  -3.548814 0.767561 2.20021
H  5.193891 3.964896 -0.711825
H  3.981098 1.523967 2.588718
H  -3.005285 -2.657211 0.709954
H  7.489191 3.980148 0.145879
H  6.284355 1.52282 3.43427
H  -5.237773 1.003974 0.603588
H  -6.511642 0.15659 -1.344526
H  -2.643872 -1.860163 -2.476838
H  -3.344456 -6.047982 -1.899493
H  -0.667463 -2.378603 -3.830009
H  -1.353364 -6.56144 -3.265547
H  0.002647 -4.72721 -4.233044
totalener: -2380.98351631 hartree
nucrepener: 3724.80540803 hartree
electener: -6105.78892434 hartree
twoeener: 4562.33605285 hartree
kineticenergy: 2373.56416909 hartree
xcener: -182.591225806072 hartree
chargesum: 0.0000000
charge: -0.086570 -0.070775 -0.180855 -0.265168 -0.365443 -0.296025 0.003950 0.103007 0.029251 -0.091091 -0.251579 -0.251217 -0.157116 0.320778 0.036678 0.330047 0.095106 -0.015393 -0.150718 -0.199598 -0.263500 -0.136966 -0.126145 -0.153157 -0.083191 0.089264 0.114832 -0.163511 0.229489 0.256991 -0.128801 -0.201231 -0.184430 -0.090513 -0.140250 0.092145 0.080513 0.072439 0.099551 0.097983 0.098353 0.109382 0.050524 0.097277 0.120522 0.121028 0.130547 0.132175 0.121580 0.121996 0.115259 0.129376 0.136335 0.127796 0.136108 0.126356 0.126604
qa: -0.0866 -0.0708 -0.1809 -0.2652 -0.3654 -0.2960 0.0040 0.1030 0.0293 -0.0911 -0.2516 -0.2512 -0.1571 0.3208 0.0367 0.3300 0.0951 -0.0154 -0.1507 -0.1996 -0.2635 -0.1370 -0.1261 -0.1532 -0.0832 0.0893 0.1148 -0.1635 0.2295 0.2570 -0.1288 -0.2012 -0.1844 -0.0905 -0.1403 0.0921 0.0805 0.0724 0.0996 0.0980 0.0984 0.1094 0.0505 0.0973 0.1205 0.1210 0.1305 0.1322 0.1216 0.1220 0.1153 0.1294 0.1363 0.1278 0.1361 0.1264 0.1266
va: 1.2478 1.2361 1.1234 2.1259 2.1400 2.1214 3.1180 3.7069 3.8285 3.8790 3.9199 3.9053 3.8524 4.2633 3.9604 3.8347 3.6469 3.6657 4.0116 4.0202 4.0264 4.0315 4.0132 4.0083 3.9412 3.9511 3.8180 3.9340 4.0906 3.8292 3.8445 4.0238 3.9621 3.9596 3.9759 1.0483 1.0385 1.0124 1.0012 1.0071 1.0029 1.0244 1.0176 1.0169 1.0183 1.0265 1.0067 1.0220 1.0137 1.0136 1.0133 1.0067 1.0047 1.0134 0.9945 0.9979 1.0004
dispcorr: -0.031580153 hartree
energy: -2381.015096459450
dipole: -7.39634 7.93120 0.53486 -16.22961 16.32620 0.09659 -16.63858 15.44156 -1.19702
magnitude: 1.31463 au
magnitude: 3.34153 debye
