program: Orca
programVersion: 5.0.2
elementType: Cl Cl F O O O N C C C C C C C C C C C C C C C C C C C C C C C C C C C C H H H H H H H H H H H H H H H H H H H H H H
charge: 0
multiplicity: 1
keywords: wb97x-d3
keywords: def2-TZVPP
keywords: def2/J RIJCOSX
keywords: DEFGRID2
keywords: scfconv7
keywords: smallprint printgap noloewdin
keywords: NOSOSCF
formula: C28H22Cl2FNO3
InChI: InChI=1/C28H22Cl2FNO3/c1-28(2)21(15-22(30)17-8-11-19(29)12-9-17)26(28)27(33)35-25(16-32)18-10-13-23(31)24(14-18)34-20-6-4-3-5-7-20/h3-15,21,25-26H,1-2H3
57 atoms
Cl 2.297179 4.246503 -0.47436
Cl 8.657441 3.057502 2.050177
F  -6.224741 -1.951874 -2.5591
O  -1.801367 -0.289262 1.509369
O  -1.985949 1.587762 0.306369
O  -4.475676 -3.645113 -1.474344
N  -3.574712 -1.699781 3.921288
C  0.49986 0.259666 -1.128585
C  0.918539 1.45173 -0.313635
C  0.07691 0.369159 0.323263
C  1.499702 -0.825052 -1.448508
C  -0.502145 0.481823 -2.235084
C  2.300756 1.641171 0.140681
C  -1.324525 0.660783 0.683016
C  3.008119 2.771157 0.107093
C  -3.189295 -0.213845 1.807307
C  4.404463 2.875299 0.557274
C  -4.029188 -0.686845 0.64688
C  5.294923 1.831014 0.31192
C  4.869145 3.990811 1.25191
C  -3.386899 -1.05319 2.991005
C  6.599222 1.878089 0.771776
C  6.170888 4.049672 1.716537
C  -3.834245 -1.964492 0.133845
C  -4.967413 0.157017 0.076619
C  7.030992 2.988884 1.477988
C  -4.576821 -2.399555 -0.951665
C  -5.723947 -0.275087 -1.001733
C  -5.517807 -1.538598 -1.510884
C  -3.239118 -4.22015 -1.593863
C  -3.087981 -5.522272 -1.144261
C  -2.18181 -3.54998 -2.19489
C  -1.868113 -6.161788 -1.306802
C  -0.96705 -4.199535 -2.346117
C  -0.80333 -5.504435 -1.903501
H  0.377161 2.362056 -0.543944
H  0.578908 -0.313703 0.999868
H  2.179666 -1.040716 -0.625294
H  2.103568 -0.546229 -2.313438
H  0.981563 -1.755355 -1.686719
H  0.023242 0.701074 -3.165612
H  -1.182148 1.306106 -2.036672
H  -1.102124 -0.415945 -2.397984
H  2.806029 0.783561 0.570698
H  -3.473608 0.809656 2.073029
H  4.973652 0.97614 -0.268673
H  4.205402 4.822761 1.444243
H  -3.106306 -2.631383 0.581482
H  7.279952 1.06337 0.568214
H  6.514276 4.916642 2.263485
H  -5.105337 1.158812 0.459961
H  -6.457791 0.37105 -1.463738
H  -3.923604 -6.027964 -0.6791
H  -2.310142 -2.537152 -2.555673
H  -1.75068 -7.179052 -0.957719
H  -0.145842 -3.683924 -2.826667
H  0.1464 -6.006468 -2.027751
totalener: -2380.98356760 hartree
nucrepener: 3716.46434561 hartree
electener: -6097.44791321 hartree
twoeener: 4554.09633483 hartree
kineticenergy: 2373.56230289 hartree
xcener: -182.590703081623 hartree
chargesum: 0.0000000
charge: -0.085807 -0.071332 -0.182570 -0.261427 -0.364982 -0.290546 0.002137 0.071968 0.036864 -0.075425 -0.240175 -0.242167 -0.169938 0.320081 0.045118 0.326991 0.094968 -0.004295 -0.205194 -0.142275 -0.264421 -0.124124 -0.141364 -0.136066 -0.106101 0.089211 0.113670 -0.148856 0.198649 0.197392 -0.179562 -0.142669 -0.096752 -0.132686 -0.137455 0.089811 0.084366 0.069866 0.101035 0.077694 0.094640 0.105632 0.067318 0.099772 0.119946 0.126109 0.122285 0.135469 0.120582 0.122724 0.113272 0.127581 0.130773 0.152314 0.128935 0.131877 0.127140
qa: -0.0858 -0.0713 -0.1826 -0.2614 -0.3650 -0.2905 0.0021 0.0720 0.0369 -0.0754 -0.2402 -0.2422 -0.1699 0.3201 0.0451 0.3270 0.0950 -0.0043 -0.2052 -0.1423 -0.2644 -0.1241 -0.1414 -0.1361 -0.1061 0.0892 0.1137 -0.1489 0.1986 0.1974 -0.1796 -0.1427 -0.0968 -0.1327 -0.1375 0.0898 0.0844 0.0699 0.1010 0.0777 0.0946 0.1056 0.0673 0.0998 0.1199 0.1261 0.1223 0.1355 0.1206 0.1227 0.1133 0.1276 0.1308 0.1523 0.1289 0.1319 0.1271
va: 1.2488 1.2358 1.1206 2.1318 2.1416 2.1135 3.1196 3.7642 3.8310 3.8593 3.9100 3.9087 3.8694 4.2777 3.9305 3.8363 3.6644 3.6856 4.0222 4.0060 4.0274 4.0118 4.0335 3.9186 3.9464 3.9506 3.8048 3.9236 4.0936 3.8732 4.0261 3.9335 3.9452 3.9587 3.9770 1.0519 1.0336 1.0150 1.0012 1.0212 1.0033 1.0212 1.0106 1.0155 1.0180 1.0085 1.0258 1.0193 1.0139 1.0133 1.0155 1.0067 1.0111 0.9887 0.9983 0.9963 1.0008
dispcorr: -0.031143094 hartree
energy: -2381.014710695412
dipole: -6.12731 6.84122 0.71391 -19.93972 19.74962 -0.19010 -12.73009 11.69603 -1.03405
magnitude: 1.27086 au
magnitude: 3.23026 debye
