program: Orca
programVersion: 5.0.2
elementType: Cl Cl F O O O N C C C C C C C C C C C C C C C C C C C C C C C C C C C C H H H H H H H H H H H H H H H H H H H H H H
charge: 0
multiplicity: 1
keywords: wb97x-d3
keywords: def2-TZVPP
keywords: def2/J RIJCOSX
keywords: DEFGRID2
keywords: scfconv7
keywords: smallprint printgap noloewdin
keywords: NOSOSCF
formula: C28H22Cl2FNO3
InChI: InChI=1/C28H22Cl2FNO3/c1-28(2)21(15-22(30)17-8-11-19(29)12-9-17)26(28)27(33)35-25(16-32)18-10-13-23(31)24(14-18)34-20-6-4-3-5-7-20/h3-15,21,25-26H,1-2H3
57 atoms
Cl 2.325523 4.656974 1.604302
Cl 9.019064 2.827264 1.688576
F  -6.762876 -1.662963 -1.955965
O  -1.126472 -0.628911 0.607017
O  -1.779315 1.483169 0.96249
O  -4.786953 -3.406406 -2.231954
N  -1.568596 -3.408641 2.338587
C  0.302474 2.117594 -1.299939
C  0.937435 2.354575 0.038502
C  0.242131 1.033217 -0.244043
C  1.17487 1.822497 -2.496948
C  -0.923587 2.924292 -1.652093
C  2.391501 2.358372 0.240122
C  -0.992297 0.705718 0.496001
C  3.101828 3.261261 0.918162
C  -2.263407 -1.103278 1.321899
C  4.553581 3.174337 1.136915
C  -3.473768 -1.24759 0.434574
C  5.365567 4.307501 1.126783
C  5.15502 1.934341 1.348932
C  -1.860372 -2.392608 1.889989
C  6.735338 4.205888 1.291265
C  6.524418 1.819687 1.51303
C  -3.535379 -2.284317 -0.491145
C  -4.51321 -0.336101 0.528939
C  7.311354 2.959333 1.479103
C  -4.648948 -2.43546 -1.300902
C  -5.626071 -0.471494 -0.288142
C  -5.689254 -1.515326 -1.183918
C  -4.16069 -4.611746 -2.04431
C  -4.309588 -5.328492 -0.864815
C  -3.409617 -5.117285 -3.092596
C  -3.686086 -6.559177 -0.738276
C  -2.800911 -6.356514 -2.9569
C  -2.931242 -7.078123 -1.780584
H  0.379633 3.022806 0.684861
H  0.886261 0.180093 -0.425358
H  1.57516 2.748246 -2.91267
H  0.591677 1.331072 -3.276801
H  2.019254 1.174165 -2.265897
H  -0.618688 3.843673 -2.154169
H  -1.516196 3.200593 -0.784425
H  -1.567238 2.371096 -2.338325
H  2.959327 1.549179 -0.205388
H  -2.497381 -0.430856 2.152992
H  4.92752 5.285383 0.980821
H  4.54367 1.043975 1.415375
H  -2.721286 -2.995373 -0.567829
H  7.352502 5.093263 1.273227
H  6.973928 0.851545 1.684253
H  -4.459597 0.483085 1.232491
H  -6.451227 0.224846 -0.225256
H  -4.903394 -4.931705 -0.051283
H  -3.310652 -4.545136 -4.005548
H  -3.794681 -7.115615 0.182888
H  -2.215925 -6.754055 -3.775588
H  -2.44833 -8.039919 -1.67499
totalener: -2380.98558183 hartree
nucrepener: 3607.76412253 hartree
electener: -5988.74970436 hartree
twoeener: 4445.96971361 hartree
kineticenergy: 2373.54988864 hartree
xcener: -182.588736045243 hartree
chargesum: 0.0000000
charge: -0.086676 -0.071423 -0.182854 -0.262732 -0.384595 -0.287756 -0.003195 0.077474 0.032732 -0.114928 -0.239632 -0.251018 -0.157280 0.365641 0.037168 0.332313 0.093356 -0.024421 -0.148942 -0.199689 -0.268183 -0.137263 -0.125338 -0.153637 -0.107312 0.089115 0.140222 -0.156560 0.198636 0.225072 -0.153630 -0.197154 -0.103940 -0.098396 -0.135411 0.091979 0.079704 0.098435 0.096216 0.070887 0.090803 0.101937 0.088876 0.097181 0.120723 0.121096 0.130582 0.132190 0.121712 0.122139 0.123164 0.126934 0.134321 0.126804 0.129600 0.127245 0.127710
qa: -0.0867 -0.0714 -0.1829 -0.2627 -0.3846 -0.2878 -0.0032 0.0775 0.0327 -0.1149 -0.2396 -0.2510 -0.1573 0.3656 0.0372 0.3323 0.0934 -0.0244 -0.1489 -0.1997 -0.2682 -0.1373 -0.1253 -0.1536 -0.1073 0.0891 0.1402 -0.1566 0.1986 0.2251 -0.1536 -0.1972 -0.1039 -0.0984 -0.1354 0.0920 0.0797 0.0984 0.0962 0.0709 0.0908 0.1019 0.0889 0.0972 0.1207 0.1211 0.1306 0.1322 0.1217 0.1221 0.1232 0.1269 0.1343 0.1268 0.1296 0.1272 0.1277
va: 1.2479 1.2355 1.1203 2.1323 2.1202 2.1197 3.1151 3.7524 3.8070 3.8970 3.9158 3.9146 3.8523 4.2171 3.9635 3.8294 3.6544 3.7064 4.0127 4.0201 4.0261 4.0312 4.0135 3.9481 3.9245 3.9505 3.7991 3.9311 4.0866 3.8159 3.9598 4.0385 3.9544 3.9355 3.9598 1.0476 1.0388 1.0031 1.0039 1.0092 1.0014 1.0208 1.0020 1.0173 1.0186 1.0268 1.0064 1.0155 1.0136 1.0136 1.0195 1.0073 1.0016 1.0120 0.9998 0.9988 0.9999
dispcorr: -0.028459535 hartree
energy: -2381.014041368599
dipole: -12.84130 12.95401 0.11271 -10.83193 11.13432 0.30240 -16.94583 16.00130 -0.94453
magnitude: 0.99814 au
magnitude: 2.53707 debye
