program: Orca
programVersion: 5.0.2
elementType: Cl Cl F O O O N C C C C C C C C C C C C C C C C C C C C C C C C C C C C H H H H H H H H H H H H H H H H H H H H H H
charge: 0
multiplicity: 1
keywords: wb97x-d3
keywords: def2-TZVPP
keywords: def2/J RIJCOSX
keywords: DEFGRID2
keywords: scfconv7
keywords: smallprint printgap noloewdin
keywords: NOSOSCF
formula: C28H22Cl2FNO3
InChI: InChI=1/C28H22Cl2FNO3/c1-28(2)21(15-22(30)17-8-11-19(29)12-9-17)26(28)27(33)35-25(16-32)18-10-13-23(31)24(14-18)34-20-6-4-3-5-7-20/h3-15,21,25-26H,1-2H3
57 atoms
Cl 4.348129 1.855364 -1.511218
Cl 7.830763 5.610406 3.193147
F  -4.499642 -4.768809 0.420956
O  -1.761242 0.760045 0.760293
O  -0.794801 0.46281 -1.238192
O  -3.360388 -3.782095 -1.866083
N  -4.634344 2.229312 1.491948
C  1.564381 -0.528987 0.569659
C  1.870869 0.84552 0.048028
C  0.549847 0.589339 0.737941
C  2.235845 -1.009443 1.834084
C  1.335257 -1.633918 -0.432364
C  2.863536 1.70841 0.70338
C  -0.697676 0.597519 -0.049044
C  3.958493 2.222736 0.142268
C  -3.05041 0.631235 0.165174
C  4.91773 3.084867 0.848444
C  -3.510218 -0.803751 0.225941
C  4.467088 4.004865 1.794886
C  6.290182 2.988312 0.623062
C  -3.930216 1.528684 0.915731
C  5.354099 4.780355 2.521188
C  7.186427 3.758782 1.342012
C  -3.302125 -1.630158 -0.873226
C  -4.068278 -1.326257 1.384883
C  6.714748 4.649182 2.294071
C  -3.634392 -2.972842 -0.812882
C  -4.412057 -2.666292 1.451906
C  -4.184665 -3.4782 0.360696
C  -4.390428 -4.396443 -2.527021
C  -4.058892 -5.515482 -3.278084
C  -5.694258 -3.924679 -2.498681
C  -5.044114 -6.167377 -3.999568
C  -6.671303 -4.593814 -3.222166
C  -6.355777 -5.714097 -3.973466
H  1.808331 0.941685 -1.030343
H  0.442034 0.962824 1.750467
H  1.665039 -1.826084 2.278158
H  2.336582 -0.232041 2.590277
H  3.236674 -1.383171 1.61308
H  2.28139 -2.137941 -0.634386
H  0.943597 -1.276775 -1.380881
H  0.641404 -2.379334 -0.039238
H  2.716612 1.931406 1.754569
H  -3.028914 0.975366 -0.873155
H  3.404725 4.138024 1.952963
H  6.670415 2.295322 -0.115238
H  -2.860656 -1.243774 -1.782898
H  4.987839 5.492631 3.247678
H  8.248749 3.665499 1.163967
H  -4.245921 -0.692263 2.243879
H  -4.847997 -3.086341 2.348094
H  -3.035869 -5.867438 -3.289398
H  -5.957481 -3.042461 -1.929435
H  -4.783345 -7.040717 -4.582565
H  -7.688692 -4.226722 -3.196485
H  -7.123088 -6.228726 -4.53528
totalener: -2380.98562326 hartree
nucrepener: 3598.14695881 hartree
electener: -5979.13258207 hartree
twoeener: 4436.10724086 hartree
kineticenergy: 2373.55083315 hartree
xcener: -182.588019386411 hartree
chargesum: 0.0000000
charge: -0.085746 -0.071647 -0.182915 -0.256413 -0.382165 -0.295818 -0.001674 0.087642 0.026512 -0.126311 -0.234632 -0.259468 -0.146296 0.362001 0.033322 0.309126 0.095649 -0.022869 -0.200339 -0.152019 -0.257612 -0.124569 -0.134827 -0.128663 -0.125652 0.087503 0.084333 -0.161345 0.262594 0.262238 -0.205863 -0.137245 -0.094137 -0.136766 -0.141380 0.095340 0.079472 0.096365 0.070861 0.098890 0.092161 0.102896 0.090509 0.098685 0.126309 0.130092 0.120105 0.131452 0.121553 0.121614 0.125266 0.130311 0.123083 0.124080 0.124844 0.126412 0.125151
qa: -0.0857 -0.0716 -0.1829 -0.2564 -0.3822 -0.2958 -0.0017 0.0876 0.0265 -0.1263 -0.2346 -0.2595 -0.1463 0.3620 0.0333 0.3091 0.0956 -0.0229 -0.2003 -0.1520 -0.2576 -0.1246 -0.1348 -0.1287 -0.1257 0.0875 0.0843 -0.1613 0.2626 0.2622 -0.2059 -0.1372 -0.0941 -0.1368 -0.1414 0.0953 0.0795 0.0964 0.0709 0.0989 0.0922 0.1029 0.0905 0.0987 0.1263 0.1301 0.1201 0.1315 0.1216 0.1216 0.1253 0.1303 0.1231 0.1241 0.1248 0.1264 0.1252
va: 1.2485 1.2352 1.1186 2.1258 2.1200 2.1053 3.1144 3.7472 3.8074 3.9118 3.9124 3.9137 3.8238 4.2259 3.9632 3.8187 3.6520 3.7075 4.0242 4.0131 4.0263 4.0118 4.0315 3.9344 3.9865 3.9516 3.8828 3.9476 4.0392 3.7788 4.0327 3.9104 3.9539 3.9859 3.9610 1.0447 1.0391 1.0039 1.0087 1.0036 1.0032 1.0194 1.0010 1.0150 1.0190 1.0069 1.0275 1.0303 1.0139 1.0137 1.0159 1.0073 1.0144 1.0104 0.9987 1.0006 1.0002
dispcorr: -0.028776249 hartree
energy: -2381.014399511245
dipole: -16.82233 17.10695 0.28462 -23.43538 22.27220 -1.16318 -5.10540 5.31405 0.20865
magnitude: 1.21554 au
magnitude: 3.08965 debye
