program: Orca
programVersion: 5.0.2
elementType: Cl Cl F O O O N C C C C C C C C C C C C C C C C C C C C C C C C C C C C H H H H H H H H H H H H H H H H H H H H H H
charge: 0
multiplicity: 1
keywords: wb97x-d3
keywords: def2-TZVPP
keywords: def2/J RIJCOSX
keywords: DEFGRID2
keywords: scfconv7
keywords: smallprint printgap noloewdin
keywords: NOSOSCF
formula: C28H22Cl2FNO3
InChI: InChI=1/C28H22Cl2FNO3/c1-28(2)21(15-22(30)17-8-11-19(29)12-9-17)26(28)27(33)35-25(16-32)18-10-13-23(31)24(14-18)34-20-6-4-3-5-7-20/h3-15,21,25-26H,1-2H3
57 atoms
Cl 1.74537 2.197868 2.385093
Cl 8.648552 2.812433 1.900762
F  -6.501724 -2.276701 -2.127481
O  -1.592127 -0.25966 1.245576
O  -2.044196 1.765643 0.405912
O  -4.078868 -3.4079 -1.938574
N  -2.876204 -2.071746 3.69541
C  0.31266 0.943184 -1.521103
C  0.793115 1.945041 -0.524843
C  0.067695 0.718979 -0.03479
C  1.310039 0.000133 -2.150133
C  -0.827673 1.31116 -2.438017
C  2.232881 2.109214 -0.229333
C  -1.28472 0.846692 0.536245
C  2.771152 2.208584 0.984993
C  -2.920205 -0.353972 1.726349
C  4.211778 2.343268 1.247313
C  -3.875251 -0.835376 0.658678
C  4.699986 3.193198 2.237756
C  5.126398 1.623716 0.480386
C  -2.875852 -1.31448 2.832052
C  6.060428 3.344423 2.438088
C  6.489728 1.764183 0.673427
C  -3.499384 -1.877559 -0.178622
C  -5.137916 -0.27649 0.54466
C  6.951076 2.630658 1.651018
C  -4.38454 -2.364596 -1.125934
C  -6.035678 -0.768031 -0.390734
C  -5.653061 -1.802661 -1.218768
C  -2.907825 -3.354751 -2.64534
C  -2.541461 -2.221098 -3.358975
C  -2.112729 -4.490296 -2.664017
C  -1.367072 -2.233891 -4.095591
C  -0.941711 -4.48993 -3.407234
C  -0.561247 -3.363379 -4.121311
H  0.208828 2.860832 -0.470193
H  0.673161 -0.058167 0.417023
H  2.11083 -0.277644 -1.464098
H  1.768944 0.455396 -3.030529
H  0.816061 -0.918678 -2.470118
H  -0.431245 1.713526 -3.371914
H  -1.491818 2.058911 -2.012124
H  -1.423658 0.430622 -2.682608
H  2.910268 2.192209 -1.073108
H  -3.263746 0.607308 2.122892
H  4.012181 3.753198 2.856793
H  4.770243 0.924065 -0.264455
H  -2.517763 -2.328256 -0.094281
H  6.426893 4.014659 3.202965
H  7.187605 1.19325 0.077015
H  -5.431001 0.545321 1.184674
H  -7.024206 -0.341331 -0.491335
H  -3.172846 -1.34131 -3.352999
H  -2.415904 -5.364673 -2.103483
H  -1.08596 -1.35425 -4.660061
H  -0.321837 -5.376479 -3.421396
H  0.352281 -3.367333 -4.700254
totalener: -2380.98171523 hartree
nucrepener: 3784.45638869 hartree
electener: -6165.43810392 hartree
twoeener: 4622.34461396 hartree
kineticenergy: 2373.56229434 hartree
xcener: -182.590590010769 hartree
chargesum: -0.0000000
charge: -0.078135 -0.069916 -0.182900 -0.269293 -0.365406 -0.294070 0.001694 0.134647 -0.019551 -0.136083 -0.278806 -0.256385 -0.223454 0.338954 0.128009 0.315858 0.062153 0.027726 -0.142860 -0.189753 -0.256383 -0.143016 -0.131746 -0.106930 -0.130645 0.095399 0.094044 -0.148733 0.202235 0.177647 -0.086976 -0.173971 -0.201731 -0.101755 -0.116469 0.109712 0.102047 0.082350 0.093973 0.099730 0.091208 0.108640 0.059128 0.120585 0.123965 0.120969 0.123796 0.133848 0.122647 0.120627 0.112059 0.126882 0.140046 0.133382 0.141313 0.128848 0.130844
qa: -0.0781 -0.0699 -0.1829 -0.2693 -0.3654 -0.2941 0.0017 0.1346 -0.0196 -0.1361 -0.2788 -0.2564 -0.2235 0.3390 0.1280 0.3159 0.0622 0.0277 -0.1429 -0.1898 -0.2564 -0.1430 -0.1317 -0.1069 -0.1306 0.0954 0.0940 -0.1487 0.2022 0.1776 -0.0870 -0.1740 -0.2017 -0.1018 -0.1165 0.1097 0.1020 0.0824 0.0940 0.0997 0.0912 0.1086 0.0591 0.1206 0.1240 0.1210 0.1238 0.1338 0.1226 0.1206 0.1121 0.1269 0.1400 0.1334 0.1413 0.1288 0.1308
va: 1.2588 1.2369 1.1199 2.1080 2.1402 2.1076 3.1203 3.6953 3.8543 3.8431 3.9229 3.9014 3.8351 4.2230 3.8396 3.8261 3.6646 3.6976 4.0119 4.0111 4.0234 4.0342 4.0253 3.8984 3.9798 3.9480 3.8090 3.9168 4.0990 3.8687 3.8501 4.0100 3.9256 3.9546 3.9051 1.0274 1.0276 1.0081 1.0003 1.0115 1.0025 1.0247 1.0190 1.0048 1.0229 1.0271 1.0065 1.0237 1.0137 1.0148 1.0111 1.0067 0.9972 1.0100 0.9939 0.9979 0.9983
dispcorr: -0.032891017 hartree
energy: -2381.014606250321
dipole: -6.00115 6.67100 0.66985 -5.22837 5.90808 0.67971 -26.74724 25.09432 -1.65293
magnitude: 1.90863 au
magnitude: 4.85136 debye
