program: Orca
programVersion: 5.0.2
elementType: Cl Cl F O O O N C C C C C C C C C C C C C C C C C C C C C C C C C C C C H H H H H H H H H H H H H H H H H H H H H H
charge: 0
multiplicity: 1
keywords: wb97x-d3
keywords: def2-TZVPP
keywords: def2/J RIJCOSX
keywords: DEFGRID2
keywords: scfconv7
keywords: smallprint printgap noloewdin
keywords: NOSOSCF
formula: C28H22Cl2FNO3
InChI: InChI=1/C28H22Cl2FNO3/c1-28(2)21(15-22(30)17-8-11-19(29)12-9-17)26(28)27(33)35-25(16-32)18-10-13-23(31)24(14-18)34-20-6-4-3-5-7-20/h3-15,21,25-26H,1-2H3
57 atoms
Cl 0.830935 0.253322 1.893201
Cl 7.467256 -0.650639 0.069879
F  -3.624875 -4.356914 -0.510767
O  -2.927274 1.836733 0.22632
O  -3.022045 1.531176 -1.982348
O  -1.474042 -2.974453 0.276354
N  -4.927814 1.611656 2.830982
C  -0.674216 3.850992 -0.46026
C  -0.1691 2.586914 0.159548
C  -1.075243 2.518799 -1.066023
C  0.243875 4.693491 -1.313364
C  -1.666825 4.677147 0.321273
C  1.220819 2.12968 0.038658
C  -2.42352 1.927605 -1.015316
C  1.781391 1.127222 0.719273
C  -4.154441 1.14831 0.378473
C  3.176069 0.678962 0.57338
C  -4.01275 -0.343602 0.164611
C  3.84115 -0.004282 1.591227
C  3.873425 0.927583 -0.612095
C  -4.575775 1.424622 1.754092
C  5.156944 -0.412521 1.443895
C  5.189213 0.532042 -0.769625
C  -2.790314 -0.964932 0.370057
C  -5.116098 -1.085317 -0.234568
C  5.825817 -0.139016 0.263652
C  -2.654321 -2.319918 0.11745
C  -4.997946 -2.450609 -0.439759
C  -3.765765 -3.049827 -0.278593
C  -0.362173 -2.549165 -0.405164
C  0.856738 -3.011036 0.074702
C  -0.416693 -1.73296 -1.527682
C  2.027198 -2.654753 -0.575524
C  0.767783 -1.375129 -2.160239
C  1.990729 -1.833442 -1.695034
H  -0.657832 2.317728 1.08828
H  -0.588236 2.294047 -2.008493
H  0.88685 4.103452 -1.965775
H  0.883466 5.318086 -0.686953
H  -0.341174 5.356261 -1.953191
H  -1.135053 5.447249 0.883015
H  -2.244358 4.099204 1.039301
H  -2.36534 5.182809 -0.348022
H  1.858472 2.653197 -0.663692
H  -4.924194 1.549718 -0.289916
H  3.342276 -0.228762 2.523642
H  3.385808 1.415863 -1.445163
H  -1.922938 -0.408534 0.704478
H  5.649348 -0.939833 2.249769
H  5.704326 0.73342 -1.69937
H  -6.071897 -0.602152 -0.393553
H  -5.849835 -3.041518 -0.750171
H  0.884658 -3.645684 0.951712
H  -1.357568 -1.368356 -1.919454
H  2.975173 -3.015559 -0.197457
H  0.722753 -0.734905 -3.032064
H  2.906851 -1.554142 -2.197735
elementType: Cl F O N C H
totalener: -2381.01029672 hartree
nucrepener: 4046.01905590 hartree
electener: -6427.02935262 hartree
twoeener: 4884.26164956 hartree
cpcmener: -0.03781322 hartree
kineticenergy: 2373.48643258 hartree
xcener: -182.589173050963 hartree
chargesum: -0.0000000
charge: -0.114790 -0.092033 -0.206794 -0.279286 -0.429103 -0.324131 -0.083602 0.103152 0.001786 -0.059348 -0.298022 -0.265455 -0.079425 0.368233 -0.002237 0.362105 0.097773 0.005707 -0.172294 -0.256605 -0.228890 -0.163072 -0.131992 -0.143625 -0.181469 0.111184 0.185116 -0.163459 0.212687 0.306528 -0.244607 -0.167297 -0.137079 -0.196749 -0.146223 0.099597 0.102490 0.090169 0.106962 0.101239 0.097136 0.094361 0.102407 0.132247 0.149229 0.134309 0.141301 0.122171 0.142901 0.142977 0.147813 0.152362 0.141011 0.149033 0.152556 0.155590 0.155456
qa: -0.1148 -0.0920 -0.2068 -0.2793 -0.4291 -0.3241 -0.0836 0.1032 0.0018 -0.0593 -0.2980 -0.2655 -0.0794 0.3682 -0.0022 0.3621 0.0978 0.0057 -0.1723 -0.2566 -0.2289 -0.1631 -0.1320 -0.1436 -0.1815 0.1112 0.1851 -0.1635 0.2127 0.3065 -0.2446 -0.1673 -0.1371 -0.1967 -0.1462 0.0996 0.1025 0.0902 0.1070 0.1012 0.0971 0.0944 0.1024 0.1322 0.1492 0.1343 0.1413 0.1222 0.1429 0.1430 0.1478 0.1524 0.1410 0.1490 0.1526 0.1556 0.1555
va: 1.2224 1.2140 1.0878 2.1080 2.0732 2.0954 3.1100 3.8344 3.7942 3.8251 3.9191 3.8996 3.7462 4.1691 3.7818 3.7340 3.4920 3.6658 3.9658 4.0076 4.0649 4.0159 3.9694 3.9389 3.9396 3.8446 3.6994 3.8724 4.0713 3.6632 3.9708 3.8253 3.8613 3.8984 3.8206 1.0371 1.0240 1.0049 0.9986 1.0011 1.0005 1.0105 1.0002 1.0035 1.0133 1.0268 1.0052 1.0278 1.0075 1.0059 0.9999 0.9968 1.0093 1.0065 0.9909 0.9946 0.9892
dispcorr: -0.038482750 hartree
energy: -2381.048779471166
dipole: -6.43010 6.93113 0.50102 27.68220 -25.81776 1.86444 -12.00955 10.47052 -1.53903
magnitude: 2.46896 au
magnitude: 6.27559 debye
