program: Orca
programVersion: 5.0.2
elementType: Cl Cl F O O O N C C C C C C C C C C C C C C C C C C C C C C C C C C C C H H H H H H H H H H H H H H H H H H H H H H
charge: 0
multiplicity: 1
keywords: wb97x-d3
keywords: def2-TZVPP
keywords: def2/J RIJCOSX
keywords: DEFGRID2
keywords: scfconv7
keywords: smallprint printgap noloewdin
keywords: NOSOSCF
formula: C28H22Cl2FNO3
InChI: InChI=1/C28H22Cl2FNO3/c1-28(2)21(15-22(30)17-8-11-19(29)12-9-17)26(28)27(33)35-25(16-32)18-10-13-23(31)24(14-18)34-20-6-4-3-5-7-20/h3-15,21,25-26H,1-2H3
57 atoms
Cl 0.444489 0.857902 1.4458
Cl 7.006704 -1.000579 0.200247
F  -3.996837 -4.632945 -1.039071
O  -2.692207 1.306438 -0.272507
O  -2.941552 3.285962 0.723855
O  -1.659554 -3.615828 -0.320928
N  -3.419221 0.870613 3.039315
C  -0.543736 4.239103 -1.080192
C  0.056198 3.525173 0.080654
C  -1.05783 2.860229 -0.716244
C  0.229812 4.293802 -2.376717
C  -1.374224 5.472856 -0.826791
C  1.398645 2.906435 0.048774
C  -2.316824 2.570862 -0.017275
C  1.692805 1.724296 0.589568
C  -3.777171 0.752354 0.448017
C  2.997634 1.050431 0.520148
C  -3.859684 -0.701637 0.055977
C  3.453027 0.211875 1.536881
C  3.808213 1.232752 -0.601546
C  -3.555679 0.854949 1.898863
C  4.684853 -0.415133 1.447831
C  5.042947 0.61546 -0.700826
C  -2.698396 -1.468364 0.075626
C  -5.067799 -1.263582 -0.318601
C  5.472795 -0.208862 0.326925
C  -2.738361 -2.79539 -0.310116
C  -5.120554 -2.60439 -0.67758
C  -3.962873 -3.347495 -0.678608
C  -0.407723 -3.08294 -0.526559
C  -0.140485 -2.26059 -1.613633
C  0.594624 -3.439986 0.361022
C  1.150834 -1.789076 -1.80144
C  1.885344 -2.971341 0.152557
C  2.167447 -2.142281 -0.923372
H  -0.25485 3.890237 1.056958
H  -0.731636 2.064069 -1.375577
H  0.790575 3.378273 -2.569952
H  0.939315 5.123487 -2.365503
H  -0.446324 4.448405 -3.219154
H  -0.74367 6.359228 -0.918273
H  -1.822257 5.492696 0.163873
H  -2.175648 5.563296 -1.562128
H  2.203119 3.451799 -0.433354
H  -4.715895 1.266358 0.217732
H  2.851514 0.037866 2.418953
H  3.468367 1.844716 -1.426751
H  -1.756788 -1.03153 0.384899
H  5.01989 -1.059177 2.249852
H  5.652031 0.76402 -1.582173
H  -5.970519 -0.667347 -0.336194
H  -6.05413 -3.064487 -0.974014
H  -0.924364 -1.989855 -2.310293
H  0.36968 -4.082151 1.203243
H  1.361955 -1.146574 -2.646559
H  2.670595 -3.252084 0.842517
H  3.173572 -1.774522 -1.078379
elementType: Cl F O N C H
totalener: -2381.01086262 hartree
nucrepener: 4015.28299414 hartree
electener: -6396.29385675 hartree
twoeener: 4854.08692294 hartree
cpcmener: -0.03915162 hartree
kineticenergy: 2373.49765651 hartree
xcener: -182.586259899054 hartree
chargesum: 0.0000000
charge: -0.112039 -0.091827 -0.207373 -0.269130 -0.437638 -0.323884 -0.082749 0.142571 -0.048849 -0.124128 -0.278903 -0.283016 -0.168757 0.376042 0.126691 0.417595 0.077492 -0.004099 -0.204447 -0.201099 -0.243423 -0.157098 -0.152641 -0.151329 -0.184071 0.116721 0.181425 -0.151049 0.186373 0.243195 -0.148696 -0.202388 -0.187761 -0.162563 -0.143053 0.120823 0.102262 0.090854 0.102093 0.099922 0.094143 0.095667 0.101157 0.141044 0.132075 0.133482 0.145953 0.116529 0.144237 0.140861 0.148103 0.150838 0.156898 0.147030 0.155280 0.156684 0.177969
qa: -0.1120 -0.0918 -0.2074 -0.2691 -0.4376 -0.3239 -0.0827 0.1426 -0.0488 -0.1241 -0.2789 -0.2830 -0.1688 0.3760 0.1267 0.4176 0.0775 -0.0041 -0.2044 -0.2011 -0.2434 -0.1571 -0.1526 -0.1513 -0.1841 0.1167 0.1814 -0.1510 0.1864 0.2432 -0.1487 -0.2024 -0.1878 -0.1626 -0.1431 0.1208 0.1023 0.0909 0.1021 0.0999 0.0941 0.0957 0.1012 0.1410 0.1321 0.1335 0.1460 0.1165 0.1442 0.1409 0.1481 0.1508 0.1569 0.1470 0.1553 0.1567 0.1780
va: 1.2388 1.2124 1.0851 2.1446 2.0644 2.0843 3.1102 3.7323 3.8792 3.8279 3.9134 3.8871 3.8209 4.1842 3.7529 3.7637 3.5035 3.7321 3.9537 3.9684 4.0279 3.9766 3.9860 3.9264 3.9116 3.8250 3.7592 3.8831 4.0573 3.7225 3.8969 4.0031 3.9087 3.8989 3.8175 1.0196 1.0249 1.0018 1.0000 1.0032 1.0011 1.0186 0.9990 0.9985 1.0137 1.0263 1.0012 1.0394 1.0063 1.0081 1.0011 0.9982 0.9939 1.0048 0.9954 0.9931 0.9660
dispcorr: -0.036855928 hartree
energy: -2381.047718545031
dipole: -3.79087 4.41729 0.62642 28.32077 -27.03119 1.28958 -14.65073 11.93661 -2.71413
magnitude: 3.06951 au
magnitude: 7.80208 debye
