program: Orca
programVersion: 5.0.2
elementType: Cl Cl F O O O N C C C C C C C C C C C C C C C C C C C C C C C C C C C C H H H H H H H H H H H H H H H H H H H H H H
charge: 0
multiplicity: 1
keywords: wb97x-d3
keywords: def2-TZVPP
keywords: def2/J RIJCOSX
keywords: DEFGRID2
keywords: scfconv7
keywords: smallprint printgap noloewdin
keywords: NOSOSCF
formula: C28H22Cl2FNO3
InChI: InChI=1/C28H22Cl2FNO3/c1-28(2)21(15-22(30)17-8-11-19(29)12-9-17)26(28)27(33)35-25(16-32)18-10-13-23(31)24(14-18)34-20-6-4-3-5-7-20/h3-15,21,25-26H,1-2H3
57 atoms
Cl 1.795332 -0.815864 -0.625045
Cl 8.179258 1.363663 -2.141054
F  -3.670651 -4.600299 -0.998058
O  -2.4353 1.344143 -0.516295
O  -2.811876 3.488764 -0.988745
O  -3.003179 -3.360732 1.243373
N  -5.509349 1.9230 0.780168
C  -0.27782 2.649559 1.340607
C  0.262874 1.755022 0.25803
C  -0.698366 2.873503 -0.098463
C  0.594819 3.7221 1.945359
C  -1.234392 2.040821 2.337433
C  1.655419 1.830624 -0.194086
C  -2.074516 2.630765 -0.574943
C  2.430687 0.811368 -0.567975
C  -3.749276 0.987235 -0.917087
C  3.844272 0.931147 -0.958458
C  -3.795708 -0.517892 -0.937437
C  4.389691 0.149141 -1.976901
C  4.673709 1.846083 -0.308435
C  -4.727791 1.531223 0.035169
C  5.716451 0.282992 -2.34784
C  6.002471 1.991269 -0.671762
C  -3.42613 -1.218526 0.205802
C  -4.145111 -1.194432 -2.094268
C  6.515455 1.205337 -1.691061
C  -3.365134 -2.599869 0.181228
C  -4.122398 -2.582994 -2.114342
C  -3.723007 -3.265609 -0.987965
C  -2.076235 -2.876638 2.134977
C  -2.3332 -3.068604 3.482948
C  -0.90339 -2.263957 1.710904
C  -1.40298 -2.637953 4.419308
C  0.008771 -1.823772 2.658488
C  -0.23573 -2.007207 4.013453
H  -0.167057 0.761145 0.251312
H  -0.26851 3.757071 -0.557547
H  1.219423 4.232438 1.213081
H  1.24996 3.298499 2.708989
H  -0.02493 4.481655 2.425361
H  -0.679769 1.695706 3.211984
H  -1.782174 1.18482 1.947826
H  -1.960943 2.780281 2.680296
H  2.11266 2.813086 -0.237833
H  -3.986203 1.388591 -1.907193
H  3.779233 -0.573786 -2.501292
H  4.290031 2.441326 0.510059
H  -3.171033 -0.687079 1.115265
H  6.118437 -0.329849 -3.143278
H  6.630922 2.699888 -0.149367
H  -4.429011 -0.64971 -2.985167
H  -4.39084 -3.129879 -3.008789
H  -3.250304 -3.55175 3.795833
H  -0.700427 -2.128389 0.65588
H  -1.601313 -2.789197 5.472479
H  0.921275 -1.341833 2.331887
H  0.482114 -1.664493 4.746823
elementType: Cl F O N C H
totalener: -2381.01312634 hartree
nucrepener: 3871.41307675 hartree
electener: -6252.42620309 hartree
twoeener: 4708.79397076 hartree
cpcmener: -0.03947898 hartree
kineticenergy: 2373.48270668 hartree
xcener: -182.581676163510 hartree
chargesum: -0.0000000
charge: -0.121740 -0.092667 -0.206635 -0.260167 -0.432874 -0.324284 -0.080745 0.115119 0.066382 -0.107054 -0.281317 -0.269321 -0.172042 0.401133 0.073617 0.363715 0.074547 -0.004577 -0.174389 -0.210733 -0.221092 -0.159888 -0.148107 -0.205477 -0.171645 0.102760 0.194259 -0.155533 0.192042 0.274171 -0.245826 -0.174534 -0.113784 -0.128051 -0.190659 0.054312 0.101195 0.090398 0.100739 0.102160 0.100113 0.062098 0.111740 0.132856 0.132428 0.137813 0.150096 0.174802 0.143388 0.143975 0.149445 0.151146 0.147511 0.151480 0.157958 0.141673 0.158073
qa: -0.1217 -0.0927 -0.2066 -0.2602 -0.4329 -0.3243 -0.0807 0.1151 0.0664 -0.1071 -0.2813 -0.2693 -0.1720 0.4011 0.0736 0.3637 0.0745 -0.0046 -0.1744 -0.2107 -0.2211 -0.1599 -0.1481 -0.2055 -0.1716 0.1028 0.1943 -0.1555 0.1920 0.2742 -0.2458 -0.1745 -0.1138 -0.1281 -0.1907 0.0543 0.1012 0.0904 0.1007 0.1022 0.1001 0.0621 0.1117 0.1329 0.1324 0.1378 0.1501 0.1748 0.1434 0.1440 0.1494 0.1511 0.1475 0.1515 0.1580 0.1417 0.1581
va: 1.2185 1.2128 1.0868 2.1592 2.0739 2.0943 3.1068 3.7052 3.8194 3.8999 3.9181 3.9302 3.8361 4.1891 3.8251 3.8047 3.5985 3.7314 3.9856 4.0040 4.0143 4.0202 3.9897 3.9258 3.9100 3.8501 3.7587 3.8849 4.0741 3.7732 4.0117 3.8699 3.8809 3.8240 3.9496 1.0343 1.0260 1.0070 1.0001 1.0007 1.0016 1.0081 1.0054 1.0051 1.0194 1.0212 1.0016 0.9842 1.0070 1.0063 0.9995 0.9981 1.0065 0.9966 0.9882 1.0098 0.9909
dispcorr: -0.033743107 hartree
energy: -2381.046869442142
dipole: -9.79526 11.30877 1.51351 16.95502 -16.70448 0.25054 21.80088 -21.89364 -0.09277
magnitude: 1.53691 au
magnitude: 3.90651 debye
