program: Orca
programVersion: 5.0.2
elementType: Cl Cl F O O O N C C C C C C C C C C C C C C C C C C C C C C C C C C C C H H H H H H H H H H H H H H H H H H H H H H
charge: 0
multiplicity: 1
keywords: wb97x-d3
keywords: def2-TZVPP
keywords: def2/J RIJCOSX
keywords: DEFGRID2
keywords: scfconv7
keywords: smallprint printgap noloewdin
keywords: NOSOSCF
formula: C28H22Cl2FNO3
InChI: InChI=1/C28H22Cl2FNO3/c1-28(2)21(15-22(30)17-8-11-19(29)12-9-17)26(28)27(33)35-25(16-32)18-10-13-23(31)24(14-18)34-20-6-4-3-5-7-20/h3-15,21,25-26H,1-2H3
57 atoms
Cl 2.395766 4.151518 -0.170577
Cl 8.512867 2.79318 2.789199
F  -6.695879 -2.1778 -2.021483
O  -1.728318 -0.373098 1.390998
O  -1.977629 1.419164 0.08161
O  -4.462425 -3.552489 -1.581868
N  -3.314434 -1.670334 3.976664
C  0.598486 0.282784 -1.302651
C  0.995557 1.378664 -0.357781
C  0.11339 0.241782 0.132725
C  1.595945 -0.783929 -1.685577
C  -0.347773 0.635279 -2.424587
C  2.349189 1.496591 0.193109
C  -1.283856 0.52667 0.49429
C  3.050114 2.620178 0.351295
C  -3.082634 -0.250198 1.79551
C  4.391117 2.687783 0.952531
C  -4.049705 -0.757324 0.751645
C  5.363471 3.566392 0.474663
C  4.718991 1.852668 2.021293
C  -3.191606 -1.05011 3.018262
C  6.630858 3.598849 1.030716
C  5.983356 1.875099 2.585934
C  -3.765106 -1.927483 0.058456
C  -5.22852 -0.068541 0.511611
C  6.932833 2.750413 2.084202
C  -4.658183 -2.40134 -0.888161
C  -6.137309 -0.551429 -0.418464
C  -5.839452 -1.704051 -1.11204
C  -3.230128 -3.795443 -2.135211
C  -2.514046 -2.802333 -2.790765
C  -2.745093 -5.092099 -2.058063
C  -1.294025 -3.121884 -3.368992
C  -1.526071 -5.397385 -2.646908
C  -0.793405 -4.415183 -3.298287
H  0.471791 2.314191 -0.517937
H  0.595641 -0.502425 0.756128
H  2.225532 -1.103738 -0.855932
H  2.250485 -0.426485 -2.483086
H  1.075231 -1.66882 -2.056556
H  0.22552 0.820202 -3.335237
H  -0.937776 1.527491 -2.227701
H  -1.03618 -0.18633 -2.631305
H  2.839585 0.581392 0.506343
H  -3.326259 0.784449 2.060254
H  5.144419 4.232474 -0.349267
H  3.974588 1.187197 2.438816
H  -2.851703 -2.478415 0.252174
H  7.373604 4.281787 0.640989
H  6.214658 1.225402 3.419204
H  -5.447122 0.845644 1.048332
H  -7.061634 -0.024393 -0.616518
H  -2.89959 -1.792461 -2.86054
H  -3.317441 -5.85429 -1.544509
H  -0.736054 -2.351392 -3.885446
H  -1.146747 -6.409229 -2.586778
H  0.158833 -4.655645 -3.752323
elementType: Cl F O N C H
totalener: -2381.01498548 hartree
nucrepener: 3721.90157370 hartree
electener: -6102.91655918 hartree
twoeener: 4559.46766758 hartree
cpcmener: -0.03801627 hartree
kineticenergy: 2373.48993052 hartree
xcener: -182.582185361280 hartree
chargesum: 0.0000000
charge: -0.111386 -0.092613 -0.207368 -0.286651 -0.438544 -0.328039 -0.085954 0.110977 0.010932 -0.068086 -0.268739 -0.274658 -0.168466 0.370006 0.039787 0.410844 0.087853 -0.002215 -0.173753 -0.208902 -0.229042 -0.159177 -0.145003 -0.138745 -0.174772 0.100841 0.145320 -0.161712 0.207780 0.249628 -0.149562 -0.231537 -0.185610 -0.124396 -0.171592 0.084517 0.096009 0.090180 0.101768 0.095064 0.103110 0.101216 0.082470 0.135556 0.142903 0.138167 0.150373 0.150074 0.142906 0.143454 0.147426 0.151473 0.161653 0.147383 0.169994 0.158095 0.158765
qa: -0.1114 -0.0926 -0.2074 -0.2867 -0.4385 -0.3280 -0.0860 0.1110 0.0109 -0.0681 -0.2687 -0.2747 -0.1685 0.3700 0.0398 0.4108 0.0879 -0.0022 -0.1738 -0.2089 -0.2290 -0.1592 -0.1450 -0.1387 -0.1748 0.1008 0.1453 -0.1617 0.2078 0.2496 -0.1496 -0.2315 -0.1856 -0.1244 -0.1716 0.0845 0.0960 0.0902 0.1018 0.0951 0.1031 0.1012 0.0825 0.1356 0.1429 0.1382 0.1504 0.1501 0.1429 0.1435 0.1474 0.1515 0.1617 0.1474 0.1700 0.1581 0.1588
va: 1.2208 1.2130 1.0859 2.1194 2.0741 2.0782 3.1133 3.6848 3.8676 3.8515 3.9200 3.9033 3.8513 4.1975 3.8949 3.7206 3.5848 3.6464 3.9855 4.0005 4.0799 4.0186 3.9856 3.9001 3.9433 3.8508 3.7552 3.8844 4.0661 3.7301 3.8566 3.9998 3.8820 3.8986 3.9033 1.0500 1.0353 1.0074 1.0003 1.0043 1.0005 1.0210 1.0061 1.0048 1.0179 1.0208 1.0010 1.0157 1.0069 1.0061 1.0007 0.9974 0.9942 1.0063 0.9810 0.9886 0.9909
dispcorr: -0.031317474 hartree
energy: -2381.046302953615
dipole: -5.10878 6.03705 0.92827 -16.54767 16.41904 -0.12863 -18.82590 17.46968 -1.35621
magnitude: 1.64850 au
magnitude: 4.19015 debye
