program: Orca
programVersion: 5.0.2
elementType: Cl Cl F O O O N C C C C C C C C C C C C C C C C C C C C C C C C C C C C H H H H H H H H H H H H H H H H H H H H H H
charge: 0
multiplicity: 1
keywords: wb97x-d3
keywords: def2-TZVPP
keywords: def2/J RIJCOSX
keywords: DEFGRID2
keywords: scfconv7
keywords: smallprint printgap noloewdin
keywords: NOSOSCF
formula: C28H22Cl2FNO3
InChI: InChI=1/C28H22Cl2FNO3/c1-28(2)21(15-22(30)17-8-11-19(29)12-9-17)26(28)27(33)35-25(16-32)18-10-13-23(31)24(14-18)34-20-6-4-3-5-7-20/h3-15,21,25-26H,1-2H3
57 atoms
Cl 2.821489 3.88093 -1.284296
Cl 8.577353 4.174957 2.596788
F  -4.827033 -2.472179 -3.100453
O  -1.772751 0.170901 1.652548
O  -1.717761 1.689873 0.013126
O  -2.819866 -3.546631 -1.602507
N  -3.996626 -1.118633 3.713682
C  0.980772 0.009025 -0.404106
C  1.25486 1.456278 -0.084906
C  0.311482 0.667761 0.78803
C  2.015947 -1.042286 -0.089298
C  0.191889 -0.294537 -1.653824
C  2.544866 1.876439 0.474296
C  -1.135776 0.938791 0.750326
C  3.321691 2.872321 0.047936
C  -3.190098 0.142206 1.572312
C  4.625556 3.21112 0.639617
C  -3.663514 -0.577115 0.330249
C  5.033541 4.534092 0.808644
C  5.478779 2.19354 1.068297
C  -3.627013 -0.565494 2.777762
C  6.242852 4.835431 1.412113
C  6.690884 2.481706 1.672731
C  -3.071527 -1.782188 -0.033669
C  -4.664466 -0.027481 -0.455132
C  7.063464 3.805157 1.844126
C  -3.462433 -2.418238 -1.196488
C  -5.076969 -0.671545 -1.612681
C  -4.465887 -1.851435 -1.974816
C  -3.50978 -4.729764 -1.655699
C  -4.645768 -4.975202 -0.896761
C  -2.987838 -5.708515 -2.491166
C  -5.262021 -6.216928 -0.986656
C  -3.612067 -6.943842 -2.564834
C  -4.753103 -7.204933 -1.816635
H  0.779833 2.159728 -0.759838
H  0.68371 0.344203 1.754279
H  2.772994 -1.081602 -0.875416
H  1.547119 -2.026506 -0.031669
H  2.527117 -0.87101 0.857558
H  0.876954 -0.431326 -2.493322
H  -0.503839 0.495899 -1.931058
H  -0.375659 -1.221369 -1.540583
H  2.912158 1.324189 1.33247
H  -3.614528 1.151272 1.60817
H  4.401744 5.34969 0.48202
H  5.207347 1.157073 0.914491
H  -2.29077 -2.232828 0.568145
H  6.536277 5.86811 1.544378
H  7.339658 1.677145 1.991689
H  -5.12094 0.913498 -0.176348
H  -5.849916 -0.248417 -2.240895
H  -5.05129 -4.222378 -0.231973
H  -2.101558 -5.501629 -3.07799
H  -6.1477 -6.408078 -0.394323
H  -3.204657 -7.704284 -3.218748
H  -5.239261 -8.169505 -1.879114
elementType: Cl F O N C H
totalener: -2381.01473248 hartree
nucrepener: 3653.97534172 hartree
electener: -6034.99007420 hartree
twoeener: 4492.11505395 hartree
cpcmener: -0.03775209 hartree
kineticenergy: 2373.48767535 hartree
xcener: -182.579521359526 hartree
chargesum: -0.0000000
charge: -0.111251 -0.092921 -0.206733 -0.277921 -0.423816 -0.330976 -0.086184 0.106460 0.017649 -0.078076 -0.266508 -0.274966 -0.176465 0.344800 0.045625 0.417090 0.086940 0.014701 -0.166694 -0.216259 -0.229101 -0.164708 -0.144476 -0.223642 -0.154068 0.101769 0.149062 -0.162739 0.270085 0.264955 -0.162093 -0.240979 -0.167039 -0.128223 -0.177673 0.082954 0.100693 0.102005 0.101787 0.086949 0.106021 0.097601 0.093728 0.137769 0.141776 0.138380 0.150367 0.144033 0.143399 0.143350 0.149316 0.153860 0.151810 0.145166 0.158842 0.156878 0.157690
qa: -0.1113 -0.0929 -0.2067 -0.2779 -0.4238 -0.3310 -0.0862 0.1065 0.0176 -0.0781 -0.2665 -0.2750 -0.1765 0.3448 0.0456 0.4171 0.0869 0.0147 -0.1667 -0.2163 -0.2291 -0.1647 -0.1445 -0.2236 -0.1541 0.1018 0.1491 -0.1627 0.2701 0.2650 -0.1621 -0.2410 -0.1670 -0.1282 -0.1777 0.0830 0.1007 0.1020 0.1018 0.0869 0.1060 0.0976 0.0937 0.1378 0.1418 0.1384 0.1504 0.1440 0.1434 0.1433 0.1493 0.1539 0.1518 0.1452 0.1588 0.1569 0.1577
va: 1.2204 1.2124 1.0864 2.1203 2.0884 2.0369 3.1106 3.7313 3.8661 3.8360 3.9052 3.8990 3.8363 4.2629 3.8578 3.7143 3.6002 3.5802 3.9772 4.0019 4.0773 4.0207 3.9863 3.9831 3.9477 3.8483 3.7179 3.9089 4.0014 3.6918 3.8631 3.9954 3.9178 3.9054 3.8962 1.0511 1.0316 1.0008 1.0023 1.0070 1.0018 1.0147 1.0029 1.0019 1.0147 1.0203 1.0012 1.0230 1.0065 1.0063 0.9998 0.9974 1.0032 1.0090 0.9910 0.9894 0.9901
dispcorr: -0.030443430 hartree
energy: -2381.045175907311
dipole: -15.11585 15.09099 -0.02486 -26.48469 25.94531 -0.53938 -5.78178 5.29888 -0.48290
magnitude: 0.72439 au
magnitude: 1.84126 debye
