program: Orca
programVersion: 5.0.2
elementType: Cl Cl F O O O N C C C C C C C C C C C C C C C C C C C C C C C C C C C C H H H H H H H H H H H H H H H H H H H H H H
charge: 0
multiplicity: 1
keywords: wb97x-d3
keywords: def2-TZVPP
keywords: def2/J RIJCOSX
keywords: DEFGRID2
keywords: scfconv7
keywords: smallprint printgap noloewdin
keywords: NOSOSCF
formula: C28H22Cl2FNO3
InChI: InChI=1/C28H22Cl2FNO3/c1-28(2)21(15-22(30)17-8-11-19(29)12-9-17)26(28)27(33)35-25(16-32)18-10-13-23(31)24(14-18)34-20-6-4-3-5-7-20/h3-15,21,25-26H,1-2H3
57 atoms
Cl 2.313351 4.555548 1.668113
Cl 9.058778 2.948805 1.490574
F  -6.60194 -1.813034 -2.109392
O  -1.150468 -0.526513 0.697274
O  -1.783288 1.613612 0.814015
O  -4.499916 -3.433233 -2.237142
N  -1.743803 -3.075895 2.72583
C  0.360394 2.011779 -1.427172
C  0.967763 2.365073 -0.101413
C  0.266848 1.025987 -0.278994
C  1.25437 1.603585 -2.573823
C  -0.847953 2.794536 -1.880639
C  2.417751 2.369935 0.118453
C  -0.98649 0.785803 0.453938
C  3.11743 3.250098 0.83577
C  -2.334575 -0.90835 1.392772
C  4.579092 3.21114 1.001792
C  -3.484133 -1.150334 0.448786
C  5.393371 2.833399 -0.066331
C  5.184179 3.526346 2.218452
C  -1.985068 -2.125352 2.128489
C  6.768322 2.747494 0.077421
C  6.557176 3.443646 2.375295
C  -3.429815 -2.207501 -0.453149
C  -4.5800 -0.300137 0.463895
C  7.341283 3.051109 1.301841
C  -4.487484 -2.435649 -1.316665
C  -5.635781 -0.513619 -0.409746
C  -5.582828 -1.580207 -1.279088
C  -4.063157 -4.684959 -1.880664
C  -4.36242 -5.246597 -0.646037
C  -3.345642 -5.394922 -2.831268
C  -3.922786 -6.532405 -0.366213
C  -2.923343 -6.684362 -2.540607
C  -3.202136 -7.255707 -1.306952
H  0.403274 3.093936 0.468808
H  0.910399 0.158243 -0.366806
H  2.057353 0.930071 -2.276259
H  1.707968 2.483595 -3.034813
H  0.670612 1.092855 -3.342019
H  -1.422802 3.220425 -1.061653
H  -1.516299 2.168844 -2.475859
H  -0.523026 3.622424 -2.51441
H  2.98939 1.565874 -0.331571
H  -2.614581 -0.154547 2.13466
H  4.956234 2.619342 -1.033098
H  4.585363 3.829744 3.067023
H  -2.569679 -2.867199 -0.480237
H  7.382894 2.458904 -0.764589
H  7.006284 3.682838 3.329791
H  -4.621721 0.527778 1.159043
H  -6.500606 0.136578 -0.406287
H  -4.933792 -4.698733 0.09285
H  -3.12296 -4.943783 -3.789966
H  -4.152591 -6.970264 0.596525
H  -2.36431 -7.239363 -3.282677
H  -2.863287 -8.258033 -1.080668
elementType: Cl F O N C H
totalener: -2381.01601370 hartree
nucrepener: 3605.04379409 hartree
electener: -5986.05980779 hartree
twoeener: 4443.27541849 hartree
cpcmener: -0.03610072 hartree
kineticenergy: 2373.48288376 hartree
xcener: -182.579567169252 hartree
chargesum: 0.0000000
charge: -0.111253 -0.092801 -0.205885 -0.286088 -0.449794 -0.327298 -0.088794 0.092070 0.021889 -0.093126 -0.269605 -0.274145 -0.169917 0.403892 0.048541 0.423759 0.088235 -0.011920 -0.212794 -0.169425 -0.231268 -0.144006 -0.162708 -0.160453 -0.149169 0.099711 0.152604 -0.170249 0.208460 0.261283 -0.168627 -0.237808 -0.149860 -0.123908 -0.179842 0.082623 0.097193 0.089597 0.101247 0.100577 0.095373 0.100638 0.098008 0.134465 0.135587 0.149978 0.138050 0.150783 0.143336 0.144134 0.147470 0.151548 0.155729 0.148004 0.159873 0.157849 0.158238
qa: -0.1113 -0.0928 -0.2059 -0.2861 -0.4498 -0.3273 -0.0888 0.0921 0.0219 -0.0931 -0.2696 -0.2741 -0.1699 0.4039 0.0485 0.4238 0.0882 -0.0119 -0.2128 -0.1694 -0.2313 -0.1440 -0.1627 -0.1605 -0.1492 0.0997 0.1526 -0.1702 0.2085 0.2613 -0.1686 -0.2378 -0.1499 -0.1239 -0.1798 0.0826 0.0972 0.0896 0.1012 0.1006 0.0954 0.1006 0.0980 0.1345 0.1356 0.1500 0.1380 0.1508 0.1433 0.1441 0.1475 0.1515 0.1557 0.1480 0.1599 0.1578 0.1582
va: 1.2209 1.2126 1.0881 2.1338 2.0636 2.0804 3.1092 3.7265 3.8492 3.8763 3.9148 3.9044 3.8549 4.1736 3.8730 3.7237 3.5910 3.6463 4.0022 3.9811 4.0745 3.9851 4.0213 3.9531 3.8983 3.8508 3.7606 3.8960 4.0671 3.7134 3.8889 4.0009 3.8995 3.8897 3.9042 1.0505 1.0328 1.0070 0.9999 1.0016 1.0185 0.9988 0.9999 1.0053 1.0193 1.0020 1.0208 1.0093 1.0062 1.0064 1.0072 0.9980 0.9970 1.0064 0.9903 0.9891 0.9902
dispcorr: -0.028465212 hartree
energy: -2381.044478913637
dipole: -13.45877 13.54219 0.08342 -11.87571 12.11339 0.23768 -16.86839 15.61689 -1.25150
magnitude: 1.27660 au
magnitude: 3.24486 debye
