program: Orca
programVersion: 5.0.2
elementType: Cl Cl F O O O N C C C C C C C C C C C C C C C C C C C C C C C C C C C C H H H H H H H H H H H H H H H H H H H H H H
charge: 0
multiplicity: 1
keywords: wb97x-d3
keywords: def2-TZVPP
keywords: def2/J RIJCOSX
keywords: DEFGRID2
keywords: scfconv7
keywords: smallprint printgap noloewdin
keywords: NOSOSCF
formula: C28H22Cl2FNO3
InChI: InChI=1/C28H22Cl2FNO3/c1-28(2)21(15-22(30)17-8-11-19(29)12-9-17)26(28)27(33)35-25(16-32)18-10-13-23(31)24(14-18)34-20-6-4-3-5-7-20/h3-15,21,25-26H,1-2H3
57 atoms
Cl 2.234972 4.597181 1.365036
Cl 9.01576 3.124063 1.644011
F  -6.527138 -1.658007 -2.215365
O  -1.202518 -0.583636 0.892728
O  -1.790612 1.564458 0.702267
O  -4.445566 -3.304168 -2.252718
N  -2.04324 -3.02224 2.945741
C  0.497615 1.575274 -1.449201
C  1.011894 2.16281 -0.166606
C  0.319548 0.810104 -0.153683
C  1.459291 0.969303 -2.443151
C  -0.673278 2.258433 -2.110541
C  2.444239 2.221789 0.139387
C  -0.990093 0.686612 0.50666
C  3.096389 3.20848 0.756699
C  -2.446336 -0.865029 1.527447
C  4.551201 3.222868 0.979275
C  -3.55234 -1.079877 0.525843
C  5.405229 2.663055 0.027218
C  5.114219 3.771443 2.131302
C  -2.204859 -2.075653 2.316321
C  6.774454 2.623371 0.227788
C  6.482403 3.740264 2.342632
C  -3.459047 -2.123225 -0.389273
C  -4.640991 -0.221195 0.501066
C  7.304897 3.162159 1.388833
C  -4.47051 -2.32667 -1.312543
C  -5.649807 -0.409407 -0.432038
C  -5.557085 -1.45821 -1.319513
C  -3.985091 -4.555235 -1.924624
C  -4.302518 -5.166229 -0.718079
C  -3.226296 -5.214478 -2.879887
C  -3.839361 -6.450751 -0.471479
C  -2.781107 -6.503502 -2.623243
C  -3.078233 -7.123956 -1.417812
H  0.412486 2.978091 0.222337
H  0.961859 -0.055986 -0.042989
H  2.244519 0.374998 -1.977308
H  1.937276 1.749714 -3.038519
H  0.922558 0.312469 -3.130162
H  -1.301038 2.811421 -1.415954
H  -1.301495 1.535889 -2.63524
H  -0.303268 2.970197 -2.851136
H  3.047354 1.372019 -0.159693
H  -2.7221 -0.070245 2.227105
H  5.004796 2.266876 -0.896843
H  4.486549 4.221953 2.888675
H  -2.602035 -2.787605 -0.381995
H  7.418535 2.18908 -0.525006
H  6.898103 4.163505 3.247073
H  -4.711567 0.595133 1.207675
H  -6.508014 0.248941 -0.465221
H  -4.905979 -4.6579 0.023676
H  -2.990545 -4.724861 -3.816434
H  -4.082894 -6.927847 0.469088
H  -2.190657 -7.019896 -3.368967
H  -2.722074 -8.125909 -1.217761
elementType: Cl F O N C H
totalener: -2381.01620168 hartree
nucrepener: 3618.39706690 hartree
electener: -5999.41326858 hartree
twoeener: 4456.61137007 hartree
cpcmener: -0.03651128 hartree
kineticenergy: 2373.48415506 hartree
xcener: -182.580576948722 hartree
chargesum: 0.0000000
charge: -0.110682 -0.092677 -0.206346 -0.283857 -0.446446 -0.326283 -0.088009 0.090535 0.017773 -0.085560 -0.272957 -0.272759 -0.160763 0.396180 0.039937 0.420119 0.089548 -0.005916 -0.211260 -0.170488 -0.232552 -0.145221 -0.160963 -0.170254 -0.159282 0.101101 0.166111 -0.164064 0.200947 0.269031 -0.176851 -0.241163 -0.146736 -0.122507 -0.181322 0.083232 0.098173 0.090368 0.101567 0.100967 0.095432 0.100925 0.097669 0.132913 0.139208 0.148526 0.137811 0.149860 0.143162 0.142926 0.148165 0.151705 0.156681 0.147726 0.159941 0.158102 0.158577
qa: -0.1107 -0.0927 -0.2063 -0.2839 -0.4464 -0.3263 -0.0880 0.0905 0.0178 -0.0856 -0.2730 -0.2728 -0.1608 0.3962 0.0399 0.4201 0.0895 -0.0059 -0.2113 -0.1705 -0.2326 -0.1452 -0.1610 -0.1703 -0.1593 0.1011 0.1661 -0.1641 0.2009 0.2690 -0.1769 -0.2412 -0.1467 -0.1225 -0.1813 0.0832 0.0982 0.0904 0.1016 0.1010 0.0954 0.1009 0.0977 0.1329 0.1392 0.1485 0.1378 0.1499 0.1432 0.1429 0.1482 0.1517 0.1567 0.1477 0.1599 0.1581 0.1586
va: 1.2223 1.2130 1.0872 2.1329 2.0696 2.0820 3.1099 3.7321 3.8578 3.8617 3.9146 3.9045 3.8512 4.1846 3.8812 3.7335 3.5971 3.6295 4.0046 3.9852 4.0742 3.9873 4.0220 3.9453 3.9085 3.8501 3.7532 3.8903 4.0671 3.7077 3.8981 4.0042 3.8969 3.8875 3.9058 1.0503 1.0320 1.0068 1.0002 1.0013 1.0181 0.9989 1.0000 1.0057 1.0162 1.0020 1.0213 1.0112 1.0064 1.0068 1.0055 0.9977 0.9965 1.0067 0.9902 0.9890 0.9902
dispcorr: -0.028628984 hartree
energy: -2381.044830666439
dipole: -11.97425 12.21438 0.24013 -15.25223 15.26508 0.01285 -16.72419 15.57321 -1.15098
magnitude: 1.17583 au
magnitude: 2.98872 debye
