program: Orca
programVersion: 5.0.2
elementType: Cl Cl F O O O N C C C C C C C C C C C C C C C C C C C C C C C C C C C C H H H H H H H H H H H H H H H H H H H H H H
charge: 0
multiplicity: 1
keywords: wb97x-d3
keywords: def2-TZVPP
keywords: def2/J RIJCOSX
keywords: DEFGRID2
keywords: scfconv7
keywords: smallprint printgap noloewdin
keywords: NOSOSCF
formula: C28H22Cl2FNO3
InChI: InChI=1/C28H22Cl2FNO3/c1-28(2)21(15-22(30)17-8-11-19(29)12-9-17)26(28)27(33)35-25(16-32)18-10-13-23(31)24(14-18)34-20-6-4-3-5-7-20/h3-15,21,25-26H,1-2H3
57 atoms
Cl 4.551325 0.401916 -0.645971
Cl 7.978877 6.051337 1.527216
F  -5.697275 -3.614305 0.723213
O  -1.853743 1.346904 -0.081675
O  -0.590453 -0.269184 -0.965104
O  -5.148336 -3.258092 -1.933472
N  -4.635002 2.926051 -0.889529
C  0.932992 0.161285 1.776982
C  1.731047 0.72054 0.632021
C  0.276148 1.113279 0.79521
C  1.140109 0.69776 3.172367
C  0.607931 -1.311482 1.753803
C  2.767068 1.739026 0.838114
C  -0.717337 0.633612 -0.179774
C  4.005134 1.733021 0.340823
C  -2.919956 0.955186 -0.931711
C  5.000627 2.78995 0.582489
C  -3.613313 -0.303049 -0.463629
C  6.357626 2.499395 0.726561
C  4.592911 4.11959 0.704599
C  -3.865951 2.073324 -0.900145
C  7.275786 3.494977 1.015657
C  5.500459 5.123641 0.996326
C  -3.994272 -1.255147 -1.398506
C  -3.905759 -0.487296 0.881581
C  6.839164 4.802613 1.155893
C  -4.701001 -2.377085 -0.999456
C  -4.596673 -1.617223 1.290902
C  -4.999367 -2.538753 0.348055
C  -4.779065 -4.576623 -1.853184
C  -3.590422 -4.990611 -1.267574
C  -5.64545 -5.494598 -2.431108
C  -3.281847 -6.344648 -1.253254
C  -5.318543 -6.841698 -2.415226
C  -4.139949 -7.27506 -1.821341
H  1.921759 0.011738 -0.165806
H  0.080459 2.105859 1.185613
H  0.276342 0.462509 3.79682
H  1.275887 1.778193 3.200636
H  2.01678 0.238345 3.633123
H  1.368589 -1.858135 2.314467
H  0.580875 -1.732565 0.7510
H  -0.355243 -1.506627 2.22998
H  2.514303 2.579244 1.475379
H  -2.58078 0.837995 -1.966321
H  6.715229 1.482985 0.629725
H  3.554898 4.387484 0.555536
H  -3.759726 -1.124828 -2.448209
H  8.321635 3.245051 1.134138
H  5.162706 6.147456 1.084798
H  -3.611918 0.247073 1.620378
H  -4.841183 -1.772055 2.333747
H  -2.901997 -4.277757 -0.830311
H  -6.566895 -5.153961 -2.887038
H  -2.357083 -6.668866 -0.793115
H  -5.996261 -7.556525 -2.863952
H  -3.892206 -8.328184 -1.804029
elementType: Cl F O N C H
totalener: -2381.01572109 hartree
nucrepener: 3602.56583310 hartree
electener: -5983.58155419 hartree
twoeener: 4440.58134095 hartree
cpcmener: -0.03805036 hartree
kineticenergy: 2373.47391469 hartree
xcener: -182.577565798212 hartree
chargesum: 0.0000000
charge: -0.110689 -0.092821 -0.207223 -0.281769 -0.436277 -0.322510 -0.086601 0.096824 0.019856 -0.089070 -0.263491 -0.269067 -0.157050 0.372241 0.035272 0.410571 0.088488 -0.001368 -0.174729 -0.211685 -0.228263 -0.157544 -0.141536 -0.182937 -0.182668 0.098672 0.142206 -0.170835 0.282385 0.263527 -0.165472 -0.238546 -0.160279 -0.124639 -0.180822 0.081924 0.097752 0.099584 0.088767 0.101446 0.100229 0.095582 0.097725 0.133448 0.141524 0.137024 0.149113 0.138933 0.143238 0.143447 0.150745 0.152284 0.155805 0.145633 0.158811 0.157358 0.157479
qa: -0.1107 -0.0928 -0.2072 -0.2818 -0.4363 -0.3225 -0.0866 0.0968 0.0199 -0.0891 -0.2635 -0.2691 -0.1571 0.3722 0.0353 0.4106 0.0885 -0.0014 -0.1747 -0.2117 -0.2283 -0.1575 -0.1415 -0.1829 -0.1827 0.0987 0.1422 -0.1708 0.2824 0.2635 -0.1655 -0.2385 -0.1603 -0.1246 -0.1808 0.0819 0.0978 0.0996 0.0888 0.1014 0.1002 0.0956 0.0977 0.1334 0.1415 0.1370 0.1491 0.1389 0.1432 0.1434 0.1507 0.1523 0.1558 0.1456 0.1588 0.1574 0.1575
va: 1.2217 1.2126 1.0833 2.1242 2.0766 2.0747 3.1128 3.7268 3.8509 3.8604 3.9123 3.9063 3.8348 4.2150 3.9038 3.7086 3.5913 3.6181 3.9873 4.0048 4.0836 4.0204 3.9835 4.0252 3.9212 3.8527 3.7889 3.9261 3.9690 3.6899 3.8712 3.9951 3.9126 3.8981 3.8992 1.0512 1.0346 1.0016 1.0056 1.0007 1.0007 1.0165 1.0003 1.0048 1.0194 1.0219 1.0014 1.0142 1.0068 1.0061 1.0100 0.9981 1.0008 1.0083 0.9908 0.9891 0.9903
dispcorr: -0.028823796 hartree
energy: -2381.044544882233
dipole: -14.22159 14.93845 0.71686 -20.64752 19.89588 -0.75164 9.18676 -7.70323 1.48353
magnitude: 1.81100 au
magnitude: 4.60320 debye
