program: Orca
programVersion: 5.0.2
elementType: Cl Cl F O O O N C C C C C C C C C C C C C C C C C C C C C C C C C C C C H H H H H H H H H H H H H H H H H H H H H H
charge: 0
multiplicity: 1
keywords: wb97x-d3
keywords: def2-TZVPP
keywords: def2/J RIJCOSX
keywords: DEFGRID2
keywords: scfconv7
keywords: smallprint printgap noloewdin
keywords: NOSOSCF
formula: C28H22Cl2FNO3
InChI: InChI=1/C28H22Cl2FNO3/c1-28(2)21(15-22(30)17-8-11-19(29)12-9-17)26(28)27(33)35-25(16-32)18-10-13-23(31)24(14-18)34-20-6-4-3-5-7-20/h3-15,21,25-26H,1-2H3
57 atoms
Cl 0.429898 0.851713 1.422893
Cl 6.985066 -1.018884 0.177886
F  -3.993891 -4.595242 -1.160211
O  -2.707854 1.311286 -0.270275
O  -2.917668 3.273466 0.772373
O  -1.66007 -3.626987 -0.359034
N  -3.250241 0.812951 3.060691
C  -0.559443 4.240817 -1.091551
C  0.049432 3.519775 0.058275
C  -1.077737 2.86335 -0.728699
C  0.198143 4.292061 -2.397113
C  -1.378959 5.478482 -0.824751
C  1.386344 2.892354 0.014355
C  -2.31927 2.570398 -0.004824
C  1.677663 1.712473 0.56069
C  -3.756487 0.737458 0.491621
C  2.982046 1.038859 0.494976
C  -3.84764 -0.707426 0.072989
C  3.441843 0.214258 1.520951
C  3.787157 1.210078 -0.632307
C  -3.459197 0.814767 1.929078
C  4.673019 -0.414405 1.43342
C  5.020614 0.590418 -0.730714
C  -2.691633 -1.482563 0.087388
C  -5.054263 -1.246973 -0.3374
C  5.453876 -0.222472 0.304922
C  -2.735846 -2.795996 -0.340679
C  -5.110515 -2.57441 -0.742614
C  -3.957302 -3.324275 -0.750843
C  -0.400634 -3.082219 -0.517273
C  -0.10924 -2.245749 -1.586944
C  0.575213 -3.438775 0.399656
C  1.182703 -1.759189 -1.729087
C  1.867468 -2.954571 0.23676
C  2.174773 -2.113615 -0.823196
H  -0.250806 3.881609 1.038998
H  -0.764051 2.070213 -1.397138
H  0.749086 3.372359 -2.596689
H  0.913467 5.116084 -2.391717
H  -0.488105 4.452874 -3.229691
H  -0.743161 6.35987 -0.923695
H  -1.811568 5.499548 0.172755
H  -2.188938 5.574947 -1.549582
H  2.189177 3.429134 -0.479098
H  -4.707745 1.249483 0.317417
H  2.843634 0.051063 2.407256
H  3.443415 1.815083 -1.460899
H  -1.751713 -1.060609 0.423034
H  5.012369 -1.049301 2.240682
H  5.625651 0.728688 -1.616258
H  -5.950682 -0.641685 -0.350238
H  -6.041625 -3.017685 -1.070277
H  -0.875787 -1.976093 -2.30317
H  0.329949 -4.091293 1.228072
H  1.414756 -1.10665 -2.560652
H  2.633814 -3.233416 0.948587
H  3.181981 -1.736526 -0.944349
elementType: Cl F O N C H
totalener: -2380.99540339 hartree
nucrepener: 4025.25178797 hartree
electener: -6406.24719137 hartree
twoeener: 4864.17856528 hartree
cpcmener: -0.04627674 hartree
kineticenergy: 2373.48492203 hartree
xcener: -182.585608324876 hartree
chargesum: 0.0000000
charge: -0.116765 -0.095231 -0.210084 -0.270504 -0.463552 -0.336904 -0.095341 0.147027 -0.052165 -0.122178 -0.279163 -0.284284 -0.160391 0.387635 0.122289 0.436870 0.084845 -0.009326 -0.213864 -0.204516 -0.242305 -0.157333 -0.148642 -0.157763 -0.181020 0.117154 0.183332 -0.152580 0.187783 0.240331 -0.145486 -0.199214 -0.203917 -0.179267 -0.124461 0.119619 0.104120 0.092863 0.102759 0.100236 0.095906 0.092722 0.102953 0.143918 0.133825 0.133997 0.148578 0.121113 0.145846 0.142743 0.152561 0.153651 0.160471 0.149784 0.158726 0.159138 0.183461
qa: -0.1168 -0.0952 -0.2101 -0.2705 -0.4636 -0.3369 -0.0953 0.1470 -0.0522 -0.1222 -0.2792 -0.2843 -0.1604 0.3876 0.1223 0.4369 0.0848 -0.0093 -0.2139 -0.2045 -0.2423 -0.1573 -0.1486 -0.1578 -0.1810 0.1172 0.1833 -0.1526 0.1878 0.2403 -0.1455 -0.1992 -0.2039 -0.1793 -0.1245 0.1196 0.1041 0.0929 0.1028 0.1002 0.0959 0.0927 0.1030 0.1439 0.1338 0.1340 0.1486 0.1211 0.1458 0.1427 0.1526 0.1537 0.1605 0.1498 0.1587 0.1591 0.1835
va: 1.2359 1.2088 1.0810 2.1472 2.0337 2.0686 3.1070 3.7294 3.8824 3.8248 3.9143 3.8851 3.8188 4.1696 3.7449 3.7445 3.4830 3.7230 3.9518 3.9673 4.0362 3.9750 3.9817 3.9255 3.8999 3.8120 3.7506 3.8797 4.0554 3.7102 3.8903 3.9956 3.9112 3.9089 3.7921 1.0209 1.0255 1.0016 0.9999 1.0027 1.0008 1.0182 0.9986 0.9979 1.0136 1.0263 1.0006 1.0362 1.0060 1.0075 0.9994 0.9970 0.9928 1.0036 0.9951 0.9930 0.9609
dispcorr: -0.037273574 hartree
energy: -2381.032676965676
dipole: -3.91337 4.47087 0.55750 28.42715 -27.03129 1.39586 -14.21300 11.37426 -2.83874
magnitude: 3.21211 au
magnitude: 8.16455 debye
