program: Orca
programVersion: 5.0.2
elementType: Cl Cl F O O O N C C C C C C C C C C C C C C C C C C C C C C C C C C C C H H H H H H H H H H H H H H H H H H H H H H
charge: 0
multiplicity: 1
keywords: wb97x-d3
keywords: def2-TZVPP
keywords: def2/J RIJCOSX
keywords: DEFGRID2
keywords: scfconv7
keywords: smallprint printgap noloewdin
keywords: NOSOSCF
formula: C28H22Cl2FNO3
InChI: InChI=1/C28H22Cl2FNO3/c1-28(2)21(15-22(30)17-8-11-19(29)12-9-17)26(28)27(33)35-25(16-32)18-10-13-23(31)24(14-18)34-20-6-4-3-5-7-20/h3-15,21,25-26H,1-2H3
57 atoms
Cl 0.889691 0.45268 2.08473
Cl 7.47293 -0.670288 0.186916
F  -3.516948 -4.312678 -0.462536
O  -3.013836 1.877115 0.154625
O  -3.185414 1.412248 -2.021933
O  -1.410057 -2.859718 0.330115
N  -4.807496 1.690331 2.907941
C  -0.659976 3.681505 -0.676859
C  -0.218641 2.399863 -0.034369
C  -1.166862 2.36366 -1.227665
C  0.282941 4.435861 -1.583121
C  -1.559075 4.597328 0.118197
C  1.14022 1.868843 -0.167561
C  -2.541163 1.85072 -1.100621
C  1.761133 1.063425 0.698697
C  -4.214522 1.170729 0.416402
C  3.164032 0.632535 0.597809
C  -4.043306 -0.321448 0.237289
C  3.630661 -0.520509 1.229116
C  4.074589 1.381424 -0.153437
C  -4.537798 1.48237 1.809383
C  4.948857 -0.926897 1.104515
C  5.392466 0.983477 -0.291802
C  -2.803403 -0.90442 0.455625
C  -5.119002 -1.095491 -0.17221
C  5.822505 -0.173104 0.340059
C  -2.621449 -2.249598 0.188707
C  -4.956457 -2.456299 -0.380244
C  -3.705158 -3.013777 -0.218597
C  -0.342784 -2.4221 -0.420542
C  -0.457367 -1.544163 -1.490774
C  0.895116 -2.941399 -0.06135
C  0.687941 -1.179509 -2.189514
C  2.02259 -2.580629 -0.781126
C  1.92907 -1.690521 -1.84341
H  -0.693763 2.198398 0.917533
H  -0.728133 2.079858 -2.177548
H  0.981076 5.033221 -0.994439
H  -0.280347 5.11845 -2.221169
H  0.862505 3.785652 -2.236716
H  -0.949156 5.342719 0.631124
H  -2.14489 4.083806 0.876532
H  -2.246334 5.13165 -0.539828
H  1.703504 2.161349 -1.045756
H  -5.040601 1.532852 -0.20463
H  2.966022 -1.131185 1.823298
H  3.769387 2.304296 -0.627607
H  -1.955893 -0.322576 0.798931
H  5.282586 -1.82766 1.601079
H  6.077442 1.582934 -0.875678
H  -6.086067 -0.640122 -0.341149
H  -5.786347 -3.072547 -0.699013
H  -1.41202 -1.137105 -1.796192
H  0.971035 -3.628092 0.772118
H  0.596557 -0.485351 -3.014939
H  2.983272 -2.990881 -0.4998
H  2.814854 -1.396315 -2.390034
elementType: Cl F O N C H
totalener: -2380.99379648 hartree
nucrepener: 4062.40417839 hartree
electener: -6443.39797487 hartree
twoeener: 4900.51745645 hartree
cpcmener: -0.04521802 hartree
kineticenergy: 2373.48257267 hartree
xcener: -182.591017016524 hartree
chargesum: -0.0000000
charge: -0.118755 -0.094914 -0.209082 -0.278455 -0.454558 -0.335303 -0.098422 0.072644 0.082157 -0.065864 -0.289003 -0.267041 -0.174003 0.380702 0.021828 0.375527 0.104477 -0.011640 -0.215291 -0.201732 -0.218919 -0.157082 -0.151536 -0.154781 -0.177751 0.114249 0.190403 -0.164685 0.218524 0.346614 -0.206167 -0.284011 -0.163384 -0.087319 -0.203819 0.090741 0.107763 0.103856 0.101563 0.094602 0.098044 0.094251 0.102499 0.135908 0.152439 0.140871 0.145222 0.137167 0.145581 0.144277 0.152525 0.156002 0.154533 0.144068 0.160662 0.159279 0.154542
qa: -0.1188 -0.0949 -0.2091 -0.2785 -0.4546 -0.3353 -0.0984 0.0726 0.0822 -0.0659 -0.2890 -0.2670 -0.1740 0.3807 0.0218 0.3755 0.1045 -0.0116 -0.2153 -0.2017 -0.2189 -0.1571 -0.1515 -0.1548 -0.1778 0.1142 0.1904 -0.1647 0.2185 0.3466 -0.2062 -0.2840 -0.1634 -0.0873 -0.2038 0.0907 0.1078 0.1039 0.1016 0.0946 0.0980 0.0943 0.1025 0.1359 0.1524 0.1409 0.1452 0.1372 0.1456 0.1443 0.1525 0.1560 0.1545 0.1441 0.1607 0.1593 0.1545
va: 1.2127 1.2115 1.0848 2.1146 2.0378 2.0856 3.1063 3.8360 3.7363 3.8124 3.9177 3.9050 3.7833 4.1402 3.8235 3.7296 3.4669 3.6454 3.9646 4.0141 4.0754 4.0168 3.9938 3.9469 3.9368 3.8287 3.6871 3.8671 4.0732 3.6242 3.8189 3.9882 3.8506 3.8076 3.8576 1.0375 1.0213 0.9995 1.0006 1.0051 0.9997 1.0110 1.0001 1.0047 1.0110 1.0225 1.0048 1.0128 1.0068 1.0062 0.9986 0.9953 1.0079 1.0113 0.9926 0.9870 0.9931
dispcorr: -0.039517045 hartree
energy: -2381.033313526160
dipole: -6.65512 6.99304 0.33792 26.17339 -24.37322 1.80017 -14.39235 12.58674 -1.80561
magnitude: 2.57197 au
magnitude: 6.53743 debye
