program: Orca
programVersion: 5.0.2
elementType: Cl F F F O O O N N C C C C C C C C C C C C C C C C C C C C C C C C C C H H H H H H H H H H H H H H H H H H H H H H
charge: 0
multiplicity: 1
keywords: wb97x-d3
keywords: def2-TZVPP
keywords: def2/J RIJCOSX
keywords: DEFGRID2
keywords: scfconv7
keywords: smallprint printgap noloewdin
keywords: NOSOSCF
formula: C26H22ClF3N2O3
InChI: InChI=1/C26H22ClF3N2O3/c1-16(2)24(32-22-12-11-18(14-21(22)27)26(28,29)30)25(33)35-23(15-31)17-7-6-10-20(13-17)34-19-8-4-3-5-9-19/h3-14,16,23-24,32H,1-2H3
57 atoms
Cl -0.652114 1.997322 -2.355596
F  -2.897801 -0.34596 2.470972
F  -2.847172 1.561099 3.45211
F  -3.973629 1.31869 1.631597
O  2.606291 -0.242427 -0.002877
O  4.431224 0.495482 1.05141
O  -2.007137 -2.642888 -0.029149
N  1.822183 2.178443 -0.763463
N  2.255601 -1.084716 3.256483
C  4.15819 2.412664 -1.402826
C  3.164065 2.06259 -0.272117
C  5.543351 2.760399 -0.872434
C  4.242533 1.323981 -2.470636
C  3.493086 0.701687 0.336411
C  0.706748 1.923636 -0.019616
C  2.682655 -1.474334 0.702557
C  -0.547305 1.789575 -0.636053
C  0.73978 1.790154 1.373417
C  1.621195 -2.394987 0.159807
C  -1.626541 1.34859 1.457167
C  -1.691313 1.498003 0.077107
C  -0.401962 1.503161 2.094348
C  0.278684 -2.048126 0.265317
C  1.988858 -3.60324 -0.413103
C  -2.838171 0.975513 2.248758
C  -0.684681 -2.93029 -0.194354
C  2.463305 -1.242206 2.1378
C  1.014101 -4.475721 -0.874609
C  -0.325162 -4.142583 -0.768612
C  -2.634835 -1.816339 -0.911487
C  -3.912756 -1.401499 -0.552941
C  -2.074808 -1.408781 -2.114692
C  -4.628053 -0.579244 -1.404948
C  -2.809904 -0.588388 -2.960019
C  -4.082614 -0.166643 -2.614628
H  3.745354 3.317369 -1.861598
H  3.325596 2.786195 0.535842
H  5.498382 3.551468 -0.123755
H  6.174005 3.114973 -1.687873
H  6.039126 1.903252 -0.419947
H  4.825454 1.678016 -3.320579
H  3.268487 1.017805 -2.855726
H  4.741692 0.430349 -2.091448
H  1.705399 2.104824 -1.760092
H  3.672298 -1.92656 0.58449
H  1.669133 1.907221 1.914958
H  -2.625018 1.385354 -0.458274
H  -0.317698 1.394199 3.167031
H  -0.025338 -1.113684 0.724203
H  3.034689 -3.872893 -0.490375
H  1.300553 -5.421096 -1.314716
H  -1.095817 -4.819414 -1.113181
H  -4.332216 -1.723465 0.390303
H  -1.078728 -1.718388 -2.401641
H  -5.620001 -0.255926 -1.118409
H  -2.370024 -0.273788 -3.896661
H  -4.644576 0.475669 -3.278673
totalener: -2099.10063606 hartree
nucrepener: 4176.39507202 hartree
electener: -6275.49570808 hartree
twoeener: 4911.83694539 hartree
kineticenergy: 2091.86104722 hartree
xcener: -173.924385819787 hartree
chargesum: 0.0000000
charge: -0.098033 -0.172106 -0.174696 -0.177752 -0.246135 -0.317413 -0.288683 -0.214468 0.005833 -0.018361 0.080333 -0.265777 -0.268470 0.261294 0.235138 0.323291 0.013691 -0.266867 0.015129 -0.100770 -0.152122 -0.087695 -0.068550 -0.110673 0.560780 0.092091 -0.268733 -0.128274 -0.117084 0.321009 -0.249858 -0.168047 -0.082881 -0.171099 -0.141082 0.064384 0.117282 0.082783 0.088535 0.098001 0.099167 0.085881 0.084593 0.130759 0.113444 0.122911 0.143031 0.129062 0.086831 0.113854 0.131192 0.131941 0.128745 0.117450 0.125855 0.128091 0.123247
qa: -0.0980 -0.1721 -0.1747 -0.1778 -0.2461 -0.3174 -0.2887 -0.2145 0.0058 -0.0184 0.0803 -0.2658 -0.2685 0.2613 0.2351 0.3233 0.0137 -0.2669 0.0151 -0.1008 -0.1521 -0.0877 -0.0685 -0.1107 0.5608 0.0921 -0.2687 -0.1283 -0.1171 0.3210 -0.2499 -0.1680 -0.0829 -0.1711 -0.1411 0.0644 0.1173 0.0828 0.0885 0.0980 0.0992 0.0859 0.0846 0.1308 0.1134 0.1229 0.1430 0.1291 0.0868 0.1139 0.1312 0.1319 0.1287 0.1175 0.1259 0.1281 0.1232
va: 1.2334 1.1142 1.1298 1.1256 2.1444 2.1816 2.1110 3.1837 3.0991 3.9238 3.8450 3.9620 3.9281 4.1573 3.8110 3.8248 3.9287 3.9466 3.7142 3.7065 3.9864 4.0122 3.9716 3.9355 4.4233 3.9929 3.9648 3.9778 4.0016 3.6733 3.9652 3.8396 3.9073 3.9178 3.9376 1.0167 1.0047 1.0089 1.0028 1.0119 1.0057 1.0186 1.0102 1.0724 1.0210 1.0188 1.0084 1.0207 1.0466 1.0103 1.0007 1.0072 1.0249 1.0168 1.0000 1.0046 1.0014
dispcorr: -0.040927255 hartree
energy: -2099.141563313626
dipole: 35.10434 -33.91767 1.18667 -1.41694 1.32525 -0.09170 -23.34680 20.95099 -2.39580
magnitude: 2.67516 au
magnitude: 6.79970 debye
