program: Orca
programVersion: 5.0.2
elementType: Cl F F F O O O N N C C C C C C C C C C C C C C C C C C C C C C C C C C H H H H H H H H H H H H H H H H H H H H H H
charge: 0
multiplicity: 1
keywords: wb97x-d3
keywords: def2-TZVPP
keywords: def2/J RIJCOSX
keywords: DEFGRID2
keywords: scfconv7
keywords: smallprint printgap noloewdin
keywords: NOSOSCF
formula: C26H22ClF3N2O3
InChI: InChI=1/C26H22ClF3N2O3/c1-16(2)24(32-22-12-11-18(14-21(22)27)26(28,29)30)25(33)35-23(15-31)17-7-6-10-20(13-17)34-19-8-4-3-5-9-19/h3-14,16,23-24,32H,1-2H3
57 atoms
Cl -0.563703 1.515403 -2.293373
F  -2.751334 0.041065 2.860073
F  -2.953949 2.099042 3.431333
F  -3.975774 1.362057 1.684072
O  2.486268 -0.133705 0.146536
O  3.930384 0.684004 1.645751
O  -1.143003 -2.675324 -2.301351
N  1.825586 2.311852 -0.708106
N  0.914926 -0.994432 3.013019
C  4.223349 2.245977 -1.195593
C  3.125334 2.135501 -0.116857
C  5.604764 2.415736 -0.573928
C  4.222249 1.092612 -2.196819
C  3.245664 0.83514 0.676198
C  0.686008 2.120417 0.030949
C  2.367727 -1.350752 0.864946
C  -0.519339 1.732571 -0.571148
C  0.66893 2.293473 1.418756
C  1.713705 -2.35931 -0.043919
C  -1.640761 1.63407 1.543044
C  -1.661253 1.483976 0.163128
C  -0.468005 2.046036 2.159452
C  0.545815 -2.024522 -0.71803
C  2.289825 -3.609647 -0.205941
C  -2.832159 1.286988 2.375058
C  -0.040177 -2.957383 -1.560792
C  1.559295 -1.135961 2.072705
C  1.693012 -4.534115 -1.050654
C  0.529821 -4.214693 -1.727241
C  -2.210879 -2.019271 -1.756907
C  -2.613987 -2.201784 -0.439961
C  -2.936175 -1.199248 -2.609133
C  -3.757982 -1.562261 0.013119
C  -4.082574 -0.574503 -2.144935
C  -4.499369 -0.750868 -0.833178
H  3.984734 3.168427 -1.73569
H  3.31336 2.936889 0.604691
H  5.923746 1.526064 -0.031014
H  5.634576 3.255132 0.121032
H  6.343684 2.606111 -1.352394
H  4.549959 0.157889 -1.739591
H  4.913516 1.311511 -3.010478
H  3.248217 0.905926 -2.651295
H  1.750221 2.022241 -1.670091
H  3.350262 -1.71198 1.184433
H  1.56039 2.61672 1.938578
H  -2.55308 1.15656 -0.35459
H  -0.422244 2.169844 3.23231
H  0.098292 -1.045714 -0.593334
H  3.201134 -3.864517 0.320075
H  2.13703 -5.511675 -1.180255
H  0.057762 -4.928148 -2.389472
H  -2.052871 -2.840135 0.230147
H  -2.603147 -1.063162 -3.629344
H  -4.070832 -1.705934 1.037841
H  -4.648093 0.060676 -2.813852
H  -5.392474 -0.259778 -0.472483
totalener: -2099.10127504 hartree
nucrepener: 4180.69036212 hartree
electener: -6279.79163716 hartree
twoeener: 4916.35928752 hartree
kineticenergy: 2091.87585246 hartree
xcener: -173.925441260533 hartree
chargesum: 0.0000000
charge: -0.096807 -0.169949 -0.175902 -0.179893 -0.249616 -0.310373 -0.294571 -0.236546 -0.000308 -0.026788 0.126552 -0.268213 -0.256775 0.233126 0.135432 0.293218 0.022057 -0.169976 0.036885 -0.059252 -0.103797 -0.166171 -0.113277 -0.151509 0.555975 0.205879 -0.249042 -0.094745 -0.192924 0.279194 -0.125439 -0.266256 -0.157734 -0.061392 -0.159280 0.067242 0.114737 0.090399 0.087239 0.089555 0.078376 0.097422 0.081990 0.136768 0.115945 0.124709 0.145080 0.122628 0.073896 0.113534 0.129284 0.130392 0.131026 0.123912 0.136034 0.126073 0.131977
qa: -0.0968 -0.1699 -0.1759 -0.1799 -0.2496 -0.3104 -0.2946 -0.2365 -0.0003 -0.0268 0.1266 -0.2682 -0.2568 0.2331 0.1354 0.2932 0.0221 -0.1700 0.0369 -0.0593 -0.1038 -0.1662 -0.1133 -0.1515 0.5560 0.2059 -0.2490 -0.0947 -0.1929 0.2792 -0.1254 -0.2663 -0.1577 -0.0614 -0.1593 0.0672 0.1147 0.0904 0.0872 0.0896 0.0784 0.0974 0.0820 0.1368 0.1159 0.1247 0.1451 0.1226 0.0739 0.1135 0.1293 0.1304 0.1310 0.1239 0.1360 0.1261 0.1320
va: 1.2348 1.1211 1.1293 1.1198 2.1371 2.1931 2.1179 3.1843 3.0888 3.9406 3.8378 3.9552 3.9410 4.1887 3.8955 3.8601 3.9353 3.9162 3.7348 3.7451 3.9104 4.0756 3.9493 3.9689 4.4248 3.8588 3.9532 3.9646 4.0273 3.7303 3.8806 3.9866 3.8989 3.8679 3.9075 1.0145 1.0041 1.0108 1.0090 1.0027 1.0126 1.0059 1.0207 1.0735 1.0256 1.0160 1.0043 1.0209 1.0536 1.0105 1.0002 1.0112 1.0055 1.0185 1.0118 0.9982 1.0035
dispcorr: -0.041115168 hartree
energy: -2099.142390205808
dipole: 36.06249 -34.57533 1.48717 -4.25206 4.06232 -0.18974 -18.40478 16.63962 -1.76516
magnitude: 2.31591 au
magnitude: 5.88659 debye
