program: Orca
programVersion: 5.0.2
elementType: Cl F F F O O O N N C C C C C C C C C C C C C C C C C C C C C C C C C C H H H H H H H H H H H H H H H H H H H H H H
charge: 0
multiplicity: 1
keywords: wb97x-d3
keywords: def2-TZVPP
keywords: def2/J RIJCOSX
keywords: DEFGRID2
keywords: scfconv7
keywords: smallprint printgap noloewdin
keywords: NOSOSCF
formula: C26H22ClF3N2O3
InChI: InChI=1/C26H22ClF3N2O3/c1-16(2)24(32-22-12-11-18(14-21(22)27)26(28,29)30)25(33)35-23(15-31)17-7-6-10-20(13-17)34-19-8-4-3-5-9-19/h3-14,16,23-24,32H,1-2H3
57 atoms
Cl 0.664746 4.85087 -0.932887
F  -4.487411 2.099953 -0.306286
F  -3.958804 2.880895 -2.239656
F  -3.86691 0.760588 -1.865336
O  2.475557 -0.88634 0.126084
O  3.070659 0.703475 -1.336763
O  -1.778596 -3.777924 0.145722
N  1.731052 2.476785 0.484247
N  5.123686 -2.46014 -1.214604
C  3.878938 1.841079 1.448931
C  2.519233 1.356002 0.916897
C  3.677153 2.751364 2.655396
C  4.792275 0.671476 1.804644
C  2.727871 0.382052 -0.238382
C  0.443242 2.333249 0.04225
C  2.594963 -1.885911 -0.883676
C  -0.198921 3.376753 -0.642373
C  -0.30717 1.172234 0.265441
C  1.761263 -3.06725 -0.449468
C  -2.210913 2.096264 -0.877955
C  -1.495328 3.264482 -1.09814
C  -1.60591 1.056311 -0.187195
C  0.388864 -2.868724 -0.341532
C  2.30945 -4.309236 -0.168071
C  -3.627866 1.962523 -1.32693
C  -0.426535 -3.912527 0.066848
C  4.011769 -2.208961 -1.073746
C  1.479248 -5.351662 0.220169
C  0.115813 -5.15958 0.349283
C  -2.33232 -2.735113 0.830305
C  -1.730991 -2.159018 1.943665
C  -3.577675 -2.297357 0.39815
C  -2.391036 -1.142554 2.620016
C  -4.227388 -1.287159 1.089756
C  -3.63724 -0.702027 2.200997
H  4.358737 2.413263 0.6458
H  2.007268 0.841028 1.735661
H  3.037359 3.603897 2.432794
H  4.635513 3.135841 3.004444
H  3.221396 2.203044 3.482481
H  4.320932 0.004217 2.528589
H  5.712826 1.042605 2.254241
H  5.084321 0.077207 0.938227
H  2.254995 3.212187 0.034915
H  2.219984 -1.49655 -1.836177
H  0.116354 0.340346 0.81071
H  -1.934305 4.097524 -1.628971
H  -2.142074 0.137325 0.006943
H  -0.047749 -1.905496 -0.581597
H  3.374968 -4.475446 -0.252613
H  1.905067 -6.32211 0.435732
H  -0.534861 -5.966447 0.659092
H  -0.766611 -2.504739 2.293348
H  -4.030902 -2.754038 -0.471799
H  -1.922804 -0.69553 3.486962
H  -5.194786 -0.946656 0.746405
H  -4.141078 0.094498 2.730401
totalener: -2099.10639672 hartree
nucrepener: 3985.82472921 hartree
electener: -6084.93112593 hartree
twoeener: 4720.32264558 hartree
kineticenergy: 2091.86278628 hartree
xcener: -173.920065846332 hartree
chargesum: -0.0000000
charge: -0.085103 -0.177293 -0.175034 -0.177376 -0.249301 -0.319127 -0.295680 -0.220551 -0.000475 0.023720 0.086205 -0.254963 -0.272794 0.250750 0.238556 0.363347 -0.046502 -0.203751 -0.022388 -0.166308 -0.067588 -0.052483 -0.185064 -0.140306 0.551658 0.195079 -0.279168 -0.086424 -0.186215 0.239853 -0.176070 -0.151543 -0.138082 -0.134335 -0.119800 0.059104 0.096173 0.095146 0.090205 0.075384 0.087942 0.088343 0.098784 0.135985 0.133851 0.115015 0.122125 0.071289 0.129880 0.130112 0.132853 0.131531 0.132303 0.125998 0.125438 0.128764 0.128330
qa: -0.0851 -0.1773 -0.1750 -0.1774 -0.2493 -0.3191 -0.2957 -0.2206 -0.0005 0.0237 0.0862 -0.2550 -0.2728 0.2508 0.2386 0.3633 -0.0465 -0.2038 -0.0224 -0.1663 -0.0676 -0.0525 -0.1851 -0.1403 0.5517 0.1951 -0.2792 -0.0864 -0.1862 0.2399 -0.1761 -0.1515 -0.1381 -0.1343 -0.1198 0.0591 0.0962 0.0951 0.0902 0.0754 0.0879 0.0883 0.0988 0.1360 0.1339 0.1150 0.1221 0.0713 0.1299 0.1301 0.1329 0.1315 0.1323 0.1260 0.1254 0.1288 0.1283
va: 1.2450 1.1139 1.1289 1.1230 2.1038 2.1876 2.1166 3.1949 3.1036 3.8733 3.8907 3.9283 3.9503 4.1537 3.8818 3.7724 3.9813 3.9518 3.8101 3.9024 3.9693 4.0275 3.9704 3.9528 4.4240 3.8803 4.0097 3.9602 4.0441 3.7861 3.8506 3.9447 3.9122 3.9176 3.8908 1.0246 1.0140 1.0238 1.0083 1.0044 1.0070 1.0064 1.0133 1.0627 1.0120 1.0161 1.0267 1.0146 1.0113 1.0230 1.0001 1.0104 1.0067 1.0144 1.0025 1.0057 1.0014
dispcorr: -0.036097119 hartree
energy: -2099.142493838492
dipole: 30.71927 -30.76967 -0.05040 -17.71815 17.32531 -0.39284 27.51010 -26.00369 1.50641
magnitude: 1.55761 au
magnitude: 3.95912 debye
