program: Orca
programVersion: 5.0.2
elementType: Cl F F F O O O N N C C C C C C C C C C C C C C C C C C C C C C C C C C H H H H H H H H H H H H H H H H H H H H H H
charge: 0
multiplicity: 1
keywords: wb97x-d3
keywords: def2-TZVPP
keywords: def2/J RIJCOSX
keywords: DEFGRID2
keywords: scfconv7
keywords: smallprint printgap noloewdin
keywords: NOSOSCF
formula: C26H22ClF3N2O3
InChI: InChI=1/C26H22ClF3N2O3/c1-16(2)24(32-22-12-11-18(14-21(22)27)26(28,29)30)25(33)35-23(15-31)17-7-6-10-20(13-17)34-19-8-4-3-5-9-19/h3-14,16,23-24,32H,1-2H3
57 atoms
Cl 0.642233 4.721346 -1.361038
F  -4.078223 0.96324 -1.353453
F  -4.42003 1.983145 0.505682
F  -4.260927 3.108725 -1.320916
O  2.593789 -0.80966 -0.008445
O  3.229486 0.724365 -1.514796
O  -1.853342 -3.303592 -0.376656
N  1.833996 2.531916 0.23735
N  5.23948 -2.616419 -0.979321
C  4.035301 2.013642 1.158507
C  2.67241 1.462448 0.704124
C  3.848246 2.995926 2.308882
C  4.98648 0.889019 1.55765
C  2.871431 0.441962 -0.409804
C  0.49543 2.378663 -0.006003
C  2.741833 -1.847096 -0.975306
C  -0.212195 3.353123 -0.726055
C  -0.246208 1.287992 0.468713
C  1.767768 -2.948188 -0.634287
C  -2.284631 2.181454 -0.447526
C  -1.571133 3.261818 -0.944167
C  -1.607675 1.196128 0.259306
C  0.415138 -2.625484 -0.634545
C  2.170605 -4.245279 -0.353858
C  -3.758641 2.063366 -0.657016
C  -0.522434 -3.602974 -0.348522
C  4.140029 -2.283945 -0.980508
C  1.219291 -5.218378 -0.08105
C  -0.128324 -4.903762 -0.0697
C  -2.388269 -2.572757 0.642754
C  -3.651133 -2.036121 0.419066
C  -1.74516 -2.372841 1.858544
C  -4.272563 -1.308113 1.419057
C  -2.382341 -1.636638 2.849392
C  -3.642529 -1.101167 2.639377
H  4.475975 2.5435 0.305733
H  2.206159 0.980566 1.567433
H  4.807144 3.424903 2.600297
H  3.432819 2.494014 3.185429
H  3.180606 3.815712 2.049099
H  4.560388 0.26926 2.349084
H  5.917988 1.306957 1.938427
H  5.253726 0.236005 0.726071
H  2.302065 3.203954 -0.351594
H  2.520624 -1.457841 -1.974391
H  0.236568 0.498277 1.027317
H  -2.059896 4.046125 -1.504332
H  -2.135722 0.340548 0.65973
H  0.081294 -1.618921 -0.861468
H  3.21986 -4.509273 -0.351687
H  1.536166 -6.229924 0.133106
H  -0.875878 -5.655493 0.14622
H  -4.136061 -2.192649 -0.535163
H  -0.764897 -2.790308 2.047146
H  -5.252571 -0.889046 1.236462
H  -1.881013 -1.486959 3.796561
H  -4.128763 -0.525535 3.414581
totalener: -2099.10623157 hartree
nucrepener: 3976.76185514 hartree
electener: -6075.86808671 hartree
twoeener: 4711.34930922 hartree
kineticenergy: 2091.86032185 hartree
xcener: -173.918276250804 hartree
chargesum: 0.0000000
charge: -0.085223 -0.176525 -0.177414 -0.175371 -0.250758 -0.329057 -0.296039 -0.218118 0.000432 0.022579 0.073975 -0.257110 -0.270055 0.270453 0.246901 0.376050 -0.031189 -0.240093 -0.054991 -0.145385 -0.076751 -0.045699 -0.168564 -0.117087 0.563276 0.152208 -0.290270 -0.102631 -0.141807 0.254474 -0.178738 -0.178033 -0.118699 -0.136630 -0.127447 0.059817 0.096528 0.090834 0.075129 0.096221 0.087529 0.088578 0.098030 0.139234 0.136207 0.121126 0.124288 0.040790 0.142788 0.131396 0.133770 0.131855 0.126263 0.126641 0.128868 0.126808 0.126635
qa: -0.0852 -0.1765 -0.1774 -0.1754 -0.2508 -0.3291 -0.2960 -0.2181 0.0004 0.0226 0.0740 -0.2571 -0.2701 0.2705 0.2469 0.3760 -0.0312 -0.2401 -0.0550 -0.1454 -0.0768 -0.0457 -0.1686 -0.1171 0.5633 0.1522 -0.2903 -0.1026 -0.1418 0.2545 -0.1787 -0.1780 -0.1187 -0.1366 -0.1274 0.0598 0.0965 0.0908 0.0751 0.0962 0.0875 0.0886 0.0980 0.1392 0.1362 0.1211 0.1243 0.0408 0.1428 0.1314 0.1338 0.1319 0.1263 0.1266 0.1289 0.1268 0.1266
va: 1.2463 1.1181 1.1183 1.1282 2.1078 2.1773 2.1108 3.1788 3.1059 3.8766 3.9197 3.9295 3.9497 4.1704 3.8186 3.7583 3.9762 3.9523 3.8298 3.8563 3.9577 4.0490 3.9858 3.9350 4.4110 3.9235 4.0246 3.9593 4.0194 3.7639 3.9463 3.8498 3.9055 3.9531 3.9096 1.0253 1.0147 1.0081 1.0044 1.0236 1.0064 1.0062 1.0137 1.0638 1.0159 1.0143 1.0268 1.0234 0.9997 1.0215 1.0005 1.0079 1.0176 1.0123 1.0063 1.0007 1.0011
dispcorr: -0.035740499 hartree
energy: -2099.141972064845
dipole: 32.12761 -32.05247 0.07514 -17.26908 16.86300 -0.40608 24.07775 -22.84053 1.23722
magnitude: 1.30432 au
magnitude: 3.31533 debye
