program: Orca
programVersion: 5.0.2
elementType: Cl F F F O O O N N C C C C C C C C C C C C C C C C C C C C C C C C C C H H H H H H H H H H H H H H H H H H H H H H
charge: 0
multiplicity: 1
keywords: wb97x-d3
keywords: def2-TZVPP
keywords: def2/J RIJCOSX
keywords: DEFGRID2
keywords: scfconv7
keywords: smallprint printgap noloewdin
keywords: NOSOSCF
formula: C26H22ClF3N2O3
InChI: InChI=1/C26H22ClF3N2O3/c1-16(2)24(32-22-12-11-18(14-21(22)27)26(28,29)30)25(33)35-23(15-31)17-7-6-10-20(13-17)34-19-8-4-3-5-9-19/h3-14,16,23-24,32H,1-2H3
57 atoms
Cl -0.589202 1.368103 -2.363928
F  -3.446353 0.708945 2.749694
F  -3.095463 2.796847 3.090107
F  -4.16443 2.158234 1.330423
O  2.67772 -0.437298 1.032905
O  4.178591 -0.572122 -0.61816
O  -1.091265 -2.162788 -2.127164
N  1.802489 1.651291 -0.663934
N  1.270146 -2.398021 3.281918
C  4.156327 2.299883 -0.971956
C  3.128493 1.567366 -0.103869
C  3.709847 3.734893 -1.235365
C  5.529573 2.291787 -0.305657
C  3.441196 0.081356 0.058246
C  0.629496 1.663743 0.036457
C  2.614134 -1.854647 1.108265
C  -0.597502 1.561396 -0.639581
C  0.562996 1.800937 1.429066
C  1.936956 -2.476909 -0.090487
C  -1.845156 1.781207 1.392948
C  -1.809761 1.617128 0.016931
C  -0.646267 1.863689 2.088203
C  0.707534 -1.99065 -0.520368
C  2.548985 -3.535141 -0.74177
C  -3.139212 1.859079 2.133827
C  0.08251 -2.595752 -1.603331
C  1.860127 -2.140916 2.330797
C  1.918827 -4.125872 -1.825547
C  0.687738 -3.66511 -2.254395
C  -2.15855 -1.788489 -1.364739
C  -3.130281 -1.043773 -2.022585
C  -2.33768 -2.158815 -0.038588
C  -4.278511 -0.665789 -1.34749
C  -3.485779 -1.755861 0.628534
C  -4.459488 -1.00919 -0.014701
H  4.236258 1.773621 -1.929312
H  3.126403 2.04272 0.880939
H  4.451938 4.253825 -1.842391
H  3.603067 4.292852 -0.302061
H  2.757274 3.789108 -1.759799
H  5.921831 1.287626 -0.157913
H  5.496529 2.793326 0.664697
H  6.249512 2.830849 -0.921391
H  1.731461 1.428992 -1.644495
H  3.618071 -2.277971 1.221321
H  1.46644 1.853877 2.017492
H  -2.719127 1.530127 -0.560293
H  -0.640013 1.977779 3.163878
H  0.237141 -1.15705 -0.011083
H  3.51643 -3.891774 -0.413197
H  2.390513 -4.951529 -2.340823
H  0.187112 -4.121043 -3.098248
H  -2.980246 -0.772261 -3.058943
H  -1.604143 -2.758983 0.482575
H  -5.033509 -0.090576 -1.867647
H  -3.61497 -2.04038 1.663647
H  -5.350937 -0.702076 0.514094
totalener: -2099.09981355 hartree
nucrepener: 4159.55593689 hartree
electener: -6258.65575043 hartree
twoeener: 4895.02785806 hartree
kineticenergy: 2091.87922677 hartree
xcener: -173.928870949654 hartree
chargesum: -0.0000000
charge: -0.092094 -0.173912 -0.177319 -0.179450 -0.263145 -0.323112 -0.286932 -0.169451 0.002316 0.068215 0.018951 -0.249914 -0.290076 0.292116 0.134844 0.282109 0.017101 -0.195366 0.091583 -0.076776 -0.128046 -0.120098 -0.295176 -0.140888 0.562315 0.292723 -0.258085 -0.079218 -0.214517 0.310569 -0.261470 -0.162033 -0.111602 -0.145142 -0.142599 0.050245 0.099576 0.091501 0.076999 0.088132 0.106848 0.079484 0.087890 0.136887 0.125963 0.105492 0.134972 0.122093 0.137977 0.105047 0.128128 0.127454 0.123245 0.141671 0.130941 0.132784 0.130244
qa: -0.0921 -0.1739 -0.1773 -0.1794 -0.2631 -0.3231 -0.2869 -0.1695 0.0023 0.0682 0.0190 -0.2499 -0.2901 0.2921 0.1348 0.2821 0.0171 -0.1954 0.0916 -0.0768 -0.1280 -0.1201 -0.2952 -0.1409 0.5623 0.2927 -0.2581 -0.0792 -0.2145 0.3106 -0.2615 -0.1620 -0.1116 -0.1451 -0.1426 0.0502 0.0996 0.0915 0.0770 0.0881 0.1068 0.0795 0.0879 0.1369 0.1260 0.1055 0.1350 0.1221 0.1380 0.1050 0.1281 0.1275 0.1232 0.1417 0.1309 0.1328 0.1302
va: 1.2430 1.1136 1.1255 1.1239 2.1243 2.1731 2.1191 3.1061 3.1094 3.8648 3.9182 3.9327 3.9489 4.2183 3.8647 3.8745 3.8529 3.9632 3.5958 3.7441 3.9618 4.1095 4.0114 4.0176 4.4219 3.7805 4.0129 3.9431 4.0662 3.6798 3.9465 3.8984 3.8720 3.9204 3.8827 1.0260 1.0159 1.0076 1.0054 1.0243 1.0169 1.0039 1.0062 1.0676 1.0132 1.0259 1.0276 1.0162 1.0108 1.0137 0.9998 1.0129 1.0231 1.0007 0.9967 1.0041 1.0034
dispcorr: -0.040467215 hartree
energy: -2099.140280762103
dipole: 35.99544 -34.46116 1.53428 -0.40793 0.69153 0.28360 -12.40271 11.29874 -1.10397
magnitude: 1.91133 au
magnitude: 4.85822 debye
