program: Orca
programVersion: 5.0.2
elementType: Cl F F F O O O N N C C C C C C C C C C C C C C C C C C C C C C C C C C H H H H H H H H H H H H H H H H H H H H H H
charge: 0
multiplicity: 1
keywords: wb97x-d3
keywords: def2-TZVPP
keywords: def2/J RIJCOSX
keywords: DEFGRID2
keywords: scfconv7
keywords: smallprint printgap noloewdin
keywords: NOSOSCF
formula: C26H22ClF3N2O3
InChI: InChI=1/C26H22ClF3N2O3/c1-16(2)24(32-22-12-11-18(14-21(22)27)26(28,29)30)25(33)35-23(15-31)17-7-6-10-20(13-17)34-19-8-4-3-5-9-19/h3-14,16,23-24,32H,1-2H3
57 atoms
Cl -1.629539 1.955807 -1.096377
F  -3.101705 0.931852 3.790322
F  -1.364001 1.031788 5.062357
F  -2.398272 2.832346 4.500333
O  2.572565 -0.528516 0.316613
O  2.293343 -0.448639 -1.906534
O  -2.368053 -2.26593 -1.667654
N  1.296313 2.101837 -0.570047
N  3.255429 -2.993433 2.409233
C  3.386326 2.269908 -1.854062
C  2.654012 1.604911 -0.688406
C  3.426434 3.782885 -1.67124
C  4.799402 1.709727 -1.986237
C  2.524164 0.096666 -0.864464
C  0.52397 1.963058 0.55702
C  2.088746 -1.876011 0.358651
C  -0.875485 1.914658 0.465648
C  1.067069 1.908074 1.8450
C  0.585193 -1.876252 0.47136
C  -1.116176 1.753473 2.844555
C  -1.681206 1.81643 1.579545
C  0.265777 1.807872 2.963611
C  -0.166509 -2.121098 -0.67154
C  -0.031595 -1.559733 1.672925
C  -1.991799 1.640027 4.049691
C  -1.551375 -2.029978 -0.610908
C  2.742039 -2.490925 1.513487
C  -1.414538 -1.491325 1.722825
C  -2.175843 -1.712724 0.589678
C  -1.852125 -2.37638 -2.93101
C  -1.219403 -1.303428 -3.543977
C  -2.02409 -3.576407 -3.601266
C  -0.749333 -1.445849 -4.839679
C  -1.560792 -3.701869 -4.902838
C  -0.91826 -2.641669 -5.523428
H  2.840971 2.038055 -2.775457
H  3.202242 1.826808 0.229097
H  3.924635 4.253192 -2.519243
H  3.984097 4.055912 -0.772714
H  2.431504 4.216736 -1.586679
H  4.809891 0.640224 -2.193425
H  5.38106 1.886772 -1.078754
H  5.324469 2.198272 -2.806947
H  0.781332 2.054507 -1.437014
H  2.404462 -2.421661 -0.535472
H  2.13795 1.943092 1.981065
H  -2.752494 1.766266 1.442397
H  0.739647 1.763372 3.934548
H  0.331769 -2.371632 -1.598338
H  0.552729 -1.373453 2.564382
H  -1.90778 -1.253713 2.654432
H  -3.255493 -1.65189 0.627464
H  -1.095043 -0.369312 -3.011196
H  -2.522263 -4.399234 -3.10564
H  -0.249703 -0.613988 -5.31782
H  -1.697696 -4.637177 -5.429079
H  -0.551562 -2.745497 -6.535594
totalener: -2099.10173549 hartree
nucrepener: 4090.58507630 hartree
electener: -6189.68681178 hartree
twoeener: 4825.36788634 hartree
kineticenergy: 2091.88138458 hartree
xcener: -173.923559630557 hartree
chargesum: 0.0000000
charge: -0.092809 -0.182965 -0.177532 -0.167567 -0.245872 -0.352442 -0.288989 -0.204949 0.001871 0.045737 0.051030 -0.254122 -0.283766 0.291489 0.111063 0.291992 0.082238 -0.132864 0.019102 -0.058798 -0.154262 -0.176424 -0.140933 -0.212324 0.556897 0.264328 -0.263051 -0.093138 -0.215874 0.233862 -0.134476 -0.172103 -0.119890 -0.111930 -0.124170 0.048466 0.099720 0.091728 0.073691 0.095567 0.102974 0.084505 0.088240 0.133307 0.127623 0.112713 0.116346 0.129577 0.127732 0.122513 0.138156 0.126396 0.090801 0.125345 0.122249 0.127097 0.126895
qa: -0.0928 -0.1830 -0.1775 -0.1676 -0.2459 -0.3524 -0.2890 -0.2049 0.0019 0.0457 0.0510 -0.2541 -0.2838 0.2915 0.1111 0.2920 0.0822 -0.1329 0.0191 -0.0588 -0.1543 -0.1764 -0.1409 -0.2123 0.5569 0.2643 -0.2631 -0.0931 -0.2159 0.2339 -0.1345 -0.1721 -0.1199 -0.1119 -0.1242 0.0485 0.0997 0.0917 0.0737 0.0956 0.1030 0.0845 0.0882 0.1333 0.1276 0.1127 0.1163 0.1296 0.1277 0.1225 0.1382 0.1264 0.0908 0.1253 0.1222 0.1271 0.1269
va: 1.2401 1.1121 1.1228 1.1296 2.1334 2.1359 2.1283 3.1422 3.1163 3.8604 3.9279 3.9324 3.9516 4.2149 3.9239 3.8356 3.8150 3.9144 3.6245 3.6713 4.0488 4.0536 3.9010 4.0001 4.4051 3.8300 4.0402 3.8739 4.0177 3.7784 3.9341 4.0343 3.9764 3.9415 3.9419 1.0305 1.0170 1.0063 1.0060 1.0204 1.0141 1.0046 1.0057 1.0721 1.0177 1.0144 1.0298 1.0158 1.0207 1.0182 1.0117 1.0148 1.0396 1.0120 1.0006 0.9993 0.9999
dispcorr: -0.038981724 hartree
energy: -2099.140717209614
dipole: 31.97430 -31.42105 0.55325 -0.98783 1.82169 0.83387 -36.65971 34.95450 -1.70520
magnitude: 1.97715 au
magnitude: 5.02553 debye
