program: Orca
programVersion: 5.0.2
elementType: Cl F F F O O O N N C C C C C C C C C C C C C C C C C C C C C C C C C C H H H H H H H H H H H H H H H H H H H H H H
charge: 0
multiplicity: 1
keywords: wb97x-d3
keywords: def2-TZVPP
keywords: def2/J RIJCOSX
keywords: DEFGRID2
keywords: scfconv7
keywords: smallprint printgap noloewdin
keywords: NOSOSCF
formula: C26H22ClF3N2O3
InChI: InChI=1/C26H22ClF3N2O3/c1-16(2)24(32-22-12-11-18(14-21(22)27)26(28,29)30)25(33)35-23(15-31)17-7-6-10-20(13-17)34-19-8-4-3-5-9-19/h3-14,16,23-24,32H,1-2H3
57 atoms
Cl 0.129762 4.277719 -1.609054
F  -3.66495 2.505223 2.147103
F  -4.09305 1.722455 0.195142
F  -3.45516 0.39814 1.773994
O  3.388932 -0.552192 0.478104
O  2.908739 0.182965 -1.587306
O  -1.29458 -2.509147 -1.676353
N  2.133807 2.592463 -0.244984
N  4.743954 -3.380394 1.537377
C  4.566772 2.480795 -0.251054
C  3.254021 1.796365 0.16972
C  4.687446 3.849425 0.411387
C  5.781216 1.618589 0.078633
C  3.161148 0.399195 -0.438392
C  0.844632 2.308662 0.108645
C  3.147996 -1.907288 0.087701
C  -0.219223 3.040516 -0.446477
C  0.507729 1.32016 1.039473
C  1.696794 -2.247203 0.315488
C  -1.837482 1.81774 0.833015
C  -1.529291 2.805508 -0.096143
C  -0.806366 1.080813 1.394041
C  0.831502 -2.261019 -0.763936
C  1.218331 -2.454953 1.60629
C  -3.257614 1.607632 1.241091
C  -0.527024 -2.488654 -0.56162
C  4.045706 -2.723522 0.904957
C  -0.133246 -2.676229 1.794746
C  -1.015793 -2.69067 0.722961
C  -2.660173 -2.558506 -1.546017
C  -3.365386 -1.405415 -1.238972
C  -3.312721 -3.761904 -1.755775
C  -4.746945 -1.463169 -1.141954
C  -4.696365 -3.806171 -1.664079
C  -5.414717 -2.660927 -1.35419
H  4.530619 2.614083 -1.339047
H  3.254173 1.712143 1.261213
H  5.591665 4.3551 0.072096
H  4.753122 3.751202 1.496804
H  3.841165 4.497493 0.189932
H  5.816453 1.366981 1.140015
H  6.696971 2.159048 -0.159781
H  5.808436 0.687365 -0.487507
H  2.247376 3.075259 -1.122456
H  3.416043 -2.056694 -0.962262
H  1.273283 0.709931 1.496155
H  -2.306363 3.399682 -0.557535
H  -1.009284 0.294319 2.107013
H  1.192855 -2.084118 -1.768884
H  1.893325 -2.458865 2.452627
H  -0.51542 -2.84951 2.791984
H  -2.068324 -2.868031 0.896721
H  -2.83582 -0.473643 -1.090302
H  -2.741758 -4.649258 -1.996091
H  -5.300684 -0.566507 -0.900779
H  -5.2126 -4.741702 -1.833431
H  -6.493104 -2.700815 -1.281258
totalener: -2099.10586061 hartree
nucrepener: 4003.08682420 hartree
electener: -6102.19268481 hartree
twoeener: 4737.88325511 hartree
kineticenergy: 2091.86903832 hartree
xcener: -173.918236742549 hartree
chargesum: 0.0000000
charge: -0.083843 -0.168565 -0.187713 -0.175870 -0.242567 -0.336483 -0.290275 -0.211265 0.001311 0.024935 0.047571 -0.254400 -0.277333 0.283788 0.263870 0.295277 -0.047272 -0.162342 0.016609 -0.105708 -0.100603 -0.189811 -0.158687 -0.192858 0.559709 0.260285 -0.255327 -0.171976 -0.149960 0.160054 -0.120067 -0.137963 -0.137044 -0.130802 -0.107458 0.058278 0.102686 0.090561 0.078647 0.092109 0.094192 0.088084 0.091884 0.134903 0.126549 0.111777 0.113382 0.134756 0.118816 0.122826 0.137125 0.132285 0.141214 0.126013 0.130119 0.127950 0.128627
qa: -0.0838 -0.1686 -0.1877 -0.1759 -0.2426 -0.3365 -0.2903 -0.2113 0.0013 0.0249 0.0476 -0.2544 -0.2773 0.2838 0.2639 0.2953 -0.0473 -0.1623 0.0166 -0.1057 -0.1006 -0.1898 -0.1587 -0.1929 0.5597 0.2603 -0.2553 -0.1720 -0.1500 0.1601 -0.1201 -0.1380 -0.1370 -0.1308 -0.1075 0.0583 0.1027 0.0906 0.0786 0.0921 0.0942 0.0881 0.0919 0.1349 0.1265 0.1118 0.1134 0.1348 0.1188 0.1228 0.1371 0.1323 0.1412 0.1260 0.1301 0.1279 0.1286
va: 1.2475 1.1293 1.1039 1.1198 2.1080 2.1693 2.1178 3.1963 3.1144 3.8642 3.8868 3.9289 3.9538 4.1315 3.8203 3.8497 3.9909 3.9323 3.6441 3.7336 4.0696 4.0607 4.0406 3.9662 4.3853 3.8601 4.0206 3.9421 3.8764 3.8829 3.9650 3.9885 3.9670 3.9472 3.9389 1.0235 1.0148 1.0077 1.0045 1.0258 1.0061 1.0051 1.0126 1.0629 1.0188 1.0281 1.0308 1.0191 1.0336 1.0166 0.9990 1.0111 0.9967 1.0091 1.0124 0.9995 0.9998
dispcorr: -0.036470907 hartree
energy: -2099.142331513113
dipole: 31.05284 -30.99803 0.05481 -8.86906 9.41788 0.54883 -0.92868 0.79291 -0.13577
magnitude: 0.56802 au
magnitude: 1.44380 debye
