program: Orca
programVersion: 5.0.2
elementType: Cl F F F O O O N N C C C C C C C C C C C C C C C C C C C C C C C C C C H H H H H H H H H H H H H H H H H H H H H H
charge: 0
multiplicity: 1
keywords: wb97x-d3
keywords: def2-TZVPP
keywords: def2/J RIJCOSX
keywords: DEFGRID2
keywords: scfconv7
keywords: smallprint printgap noloewdin
keywords: NOSOSCF
formula: C26H22ClF3N2O3
InChI: InChI=1/C26H22ClF3N2O3/c1-16(2)24(32-22-12-11-18(14-21(22)27)26(28,29)30)25(33)35-23(15-31)17-7-6-10-20(13-17)34-19-8-4-3-5-9-19/h3-14,16,23-24,32H,1-2H3
57 atoms
Cl 1.147731 4.662467 -1.553269
F  -3.148146 0.883024 -1.861966
F  -3.705335 1.144716 0.195916
F  -3.732323 2.825218 -1.154584
O  3.104471 -0.656447 0.599306
O  3.437481 0.540672 -1.269777
O  -1.589203 -3.036134 1.293497
N  2.434264 2.715854 0.280337
N  3.848271 -3.824186 1.225518
C  4.725365 2.246754 0.992581
C  3.296485 1.702657 0.831599
C  4.73868 3.449071 1.930614
C  5.67607 1.165553 1.498627
C  3.29666 0.479916 -0.082995
C  1.104702 2.476461 0.045455
C  2.870369 -1.843575 -0.165916
C  0.361928 3.313188 -0.80204
C  0.412895 1.417371 0.643217
C  1.393939 -1.983598 -0.442788
C  -1.630759 2.019913 -0.475129
C  -0.972352 3.089715 -1.066959
C  -0.924174 1.193766 0.385472
C  0.540376 -2.480885 0.53018
C  0.888719 -1.525057 -1.654076
C  -3.052251 1.723622 -0.820377
C  -0.828533 -2.529745 0.290112
C  3.413989 -2.946994 0.625204
C  -0.476201 -1.569215 -1.876456
C  -1.343221 -2.068428 -0.916697
C  -2.951846 -3.086266 1.132018
C  -3.72293 -1.986788 1.473339
C  -3.538116 -4.245915 0.650513
C  -5.100079 -2.049878 1.32611
C  -4.917298 -4.301181 0.513751
C  -5.699668 -3.204506 0.845121
H  5.068549 2.564958 0.000782
H  2.935286 1.413603 1.823414
H  4.076498 4.246773 1.598124
H  5.745699 3.860289 2.0027
H  4.4286 3.160049 2.936726
H  6.664526 1.589313 1.673205
H  5.804716 0.345856 0.791692
H  5.329892 0.741252 2.442748
H  2.878545 3.314179 -0.399545
H  3.424703 -1.803361 -1.108009
H  0.918542 0.743094 1.318833
H  -1.488358 3.761096 -1.739296
H  -1.403609 0.352813 0.865084
H  0.92129 -2.850716 1.475012
H  1.551847 -1.122441 -2.407131
H  -0.880664 -1.204054 -2.810375
H  -2.405984 -2.090751 -1.1152
H  -3.250647 -1.092818 1.858238
H  -2.919346 -5.095442 0.392546
H  -5.703633 -1.191105 1.58688
H  -5.380575 -5.205617 0.142626
H  -6.77425 -3.250529 0.731751
totalener: -2099.10489548 hartree
nucrepener: 4004.21423906 hartree
electener: -6103.31913454 hartree
twoeener: 4739.11616705 hartree
kineticenergy: 2091.87200945 hartree
xcener: -173.920022146249 hartree
chargesum: 0.0000000
charge: -0.085379 -0.175809 -0.181703 -0.174402 -0.241106 -0.339438 -0.288757 -0.222828 0.002298 0.018132 0.071001 -0.254099 -0.276822 0.273686 0.246742 0.301748 -0.030512 -0.210952 0.006204 -0.080603 -0.100020 -0.148932 -0.217370 -0.116934 0.556349 0.225530 -0.263366 -0.132146 -0.164752 0.183122 -0.150936 -0.135678 -0.125468 -0.128860 -0.107333 0.057676 0.099000 0.093492 0.089982 0.078082 0.088128 0.093151 0.093102 0.134723 0.129060 0.113887 0.117889 0.116492 0.117873 0.125780 0.131588 0.134546 0.138508 0.129180 0.129910 0.128519 0.128825
qa: -0.0854 -0.1758 -0.1817 -0.1744 -0.2411 -0.3394 -0.2888 -0.2228 0.0023 0.0181 0.0710 -0.2541 -0.2768 0.2737 0.2467 0.3017 -0.0305 -0.2110 0.0062 -0.0806 -0.1000 -0.1489 -0.2174 -0.1169 0.5563 0.2255 -0.2634 -0.1321 -0.1648 0.1831 -0.1509 -0.1357 -0.1255 -0.1289 -0.1073 0.0577 0.0990 0.0935 0.0900 0.0781 0.0881 0.0932 0.0931 0.1347 0.1291 0.1139 0.1179 0.1165 0.1179 0.1258 0.1316 0.1345 0.1385 0.1292 0.1299 0.1285 0.1288
va: 1.2445 1.1097 1.1185 1.1298 2.1083 2.1666 2.1056 3.1997 3.1148 3.8701 3.8804 3.9314 3.9509 4.1524 3.8207 3.8371 3.9858 3.9981 3.6879 3.7330 4.0576 4.0669 4.0749 3.9172 4.4120 3.8313 4.0273 3.9583 3.8566 3.8543 3.9723 3.9959 3.9726 3.9470 3.9323 1.0244 1.0138 1.0237 1.0078 1.0047 1.0049 1.0128 1.0065 1.0629 1.0187 1.0279 1.0279 0.9995 1.0329 1.0192 1.0041 1.0160 1.0010 1.0070 1.0033 0.9996 0.9993
dispcorr: -0.037021751 hartree
energy: -2099.141917226236
dipole: 26.79977 -26.81368 -0.01391 -11.47635 12.18562 0.70927 16.04577 -16.09568 -0.04990
magnitude: 0.71116 au
magnitude: 1.80763 debye
