program: Orca
programVersion: 5.0.2
elementType: Cl F F F O O O N N C C C C C C C C C C C C C C C C C C C C C C C C C C H H H H H H H H H H H H H H H H H H H H H H
charge: 0
multiplicity: 1
keywords: wb97x-d3
keywords: def2-TZVPP
keywords: def2/J RIJCOSX
keywords: DEFGRID2
keywords: scfconv7
keywords: smallprint printgap noloewdin
keywords: NOSOSCF
formula: C26H22ClF3N2O3
InChI: InChI=1/C26H22ClF3N2O3/c1-16(2)24(32-22-12-11-18(14-21(22)27)26(28,29)30)25(33)35-23(15-31)17-7-6-10-20(13-17)34-19-8-4-3-5-9-19/h3-14,16,23-24,32H,1-2H3
57 atoms
Cl 1.113718 2.498149 -2.766495
F  -4.088105 1.561603 0.659871
F  -3.944234 3.037115 -0.900599
F  -3.866952 0.953989 -1.391162
O  3.137067 -0.511298 -0.173812
O  2.246699 -0.681053 1.872603
O  -2.277789 -1.589548 -0.176669
N  2.198021 2.097401 -0.020319
N  2.913814 -3.769952 1.031464
C  4.438356 1.873707 0.952963
C  2.955226 1.489857 1.050624
C  4.608674 3.377892 1.123016
C  5.255659 1.115982 1.992607
C  2.74304 -0.017058 1.00499
C  0.836812 1.995594 -0.111785
C  2.650064 -1.769942 -0.626833
C  0.176202 2.191562 -1.338731
C  0.023282 1.724981 0.996643
C  1.250611 -1.630853 -1.174829
C  -1.978353 1.886677 -0.330008
C  -1.195581 2.142838 -1.450515
C  -1.353858 1.674295 0.890276
C  0.130141 -1.734553 -0.356343
C  1.114387 -1.320896 -2.521964
C  -3.460484 1.855733 -0.483399
C  -1.130831 -1.544824 -0.906598
C  2.783418 -2.846077 0.361286
C  -0.150733 -1.12468 -3.054442
C  -1.274344 -1.239999 -2.255721
C  -2.372811 -2.329982 0.970886
C  -3.037841 -1.747959 2.040202
C  -1.896381 -3.63248 1.054764
C  -3.221954 -2.475435 3.207004
C  -2.0750 -4.342549 2.233051
C  -2.734499 -3.770287 3.312615
H  4.800151 1.594155 -0.042764
H  2.581938 1.835885 2.017504
H  5.662089 3.649237 1.040645
H  4.258482 3.706516 2.104219
H  4.066508 3.945679 0.366701
H  6.296757 1.439132 1.961669
H  5.25621 0.036851 1.826437
H  4.883569 1.299288 3.003094
H  2.692328 2.136552 -0.900217
H  3.324744 -2.037891 -1.442588
H  0.465053 1.561998 1.969457
H  -1.648503 2.300646 -2.421464
H  -1.925435 1.46769 1.784549
H  0.23754 -1.964915 0.695463
H  1.98963 -1.239349 -3.153836
H  -0.263932 -0.887638 -4.103922
H  -2.262877 -1.095359 -2.67185
H  -3.420189 -0.739408 1.95339
H  -1.392875 -4.095372 0.215358
H  -3.744059 -2.02037 4.038827
H  -1.698127 -5.354818 2.301767
H  -2.871448 -4.332096 4.227088
elementType: Cl F O N C H
totalener: -2099.12801115 hartree
nucrepener: 4166.51635999 hartree
electener: -6265.64437114 hartree
twoeener: 4902.49306220 hartree
cpcmener: -0.03765216 hartree
kineticenergy: 2091.80123757 hartree
xcener: -173.916377715732 hartree
chargesum: -0.0000000
charge: -0.102263 -0.182962 -0.187008 -0.186948 -0.265593 -0.392451 -0.316228 -0.225094 -0.083995 0.050122 0.133857 -0.290995 -0.298711 0.311029 0.150614 0.385875 0.026328 -0.198342 0.038886 -0.038441 -0.170050 -0.176852 -0.192927 -0.237277 0.572082 0.292829 -0.230302 -0.098912 -0.271944 0.315896 -0.257855 -0.219448 -0.128982 -0.131270 -0.184320 0.057503 0.119993 0.096921 0.086533 0.093405 0.094710 0.094852 0.097374 0.151782 0.136906 0.135671 0.125216 0.149126 0.142321 0.138905 0.153944 0.143221 0.147933 0.152765 0.156641 0.158950 0.156984
qa: -0.1023 -0.1830 -0.1870 -0.1869 -0.2656 -0.3925 -0.3162 -0.2251 -0.0840 0.0501 0.1339 -0.2910 -0.2987 0.3110 0.1506 0.3859 0.0263 -0.1983 0.0389 -0.0384 -0.1701 -0.1769 -0.1929 -0.2373 0.5721 0.2928 -0.2303 -0.0989 -0.2719 0.3159 -0.2579 -0.2194 -0.1290 -0.1313 -0.1843 0.0575 0.1200 0.0969 0.0865 0.0934 0.0947 0.0949 0.0974 0.1518 0.1369 0.1357 0.1252 0.1491 0.1423 0.1389 0.1539 0.1432 0.1479 0.1528 0.1566 0.1589 0.1570
va: 1.2193 1.1155 1.1067 1.1020 2.1371 2.1009 2.0585 3.1893 3.1024 3.8250 3.8489 3.9359 3.9532 4.1233 3.8731 3.9415 3.8046 3.9170 3.5898 3.5357 4.0727 3.9573 3.8969 3.9490 4.4022 3.6753 4.0624 3.8428 3.9561 3.6739 3.9852 3.9373 3.9149 3.8816 3.9132 1.0273 1.0045 1.0047 1.0019 1.0166 1.0030 1.0092 1.0038 1.0505 0.9985 1.0220 1.0285 1.0031 1.0245 1.0044 0.9910 1.0170 1.0127 0.9994 0.9913 0.9897 0.9906
dispcorr: -0.040689641 hartree
energy: -2099.168700791417
dipole: 35.22946 -33.30555 1.92390 -7.57598 8.82879 1.25281 18.99933 -20.06160 -1.06226
magnitude: 2.52969 au
magnitude: 6.42997 debye
